{"text_format":"1","workbook":"xlsx","n_sheets":9,"sheets":["MAIN","VRX SOLUTIONS","MAIN -ORIGINAL","VRX SOLUTIONS- MAP","DVR SOLUTIONS- MAP","DVR SOLUTIONS","DVR Suitcase","Lookups -ORIGINAL","Lookups"],"not_rendered":{"charts":0,"images":1,"macros":1,"external_links":1,"defined_names":68,"comments":2,"pivot_tables":0},"unopened":[],"bounds":{"document_bytes":16777216,"sheet_cells":100000,"rows_first":2000,"rows_last":500,"rows_between":2000,"halvings":0,"cell_chars":16384,"cell_head_chars":4096},"cells_cut":0,"cells_raw":0,"read":"whole","date_system":"1900"}

{"sheet":"MAIN","index":0,"n_rows":44,"n_cols":12,"rows_kept":44,"cut":false,"hidden":false,"merged":[[42,2,42,3],[28,4,29,12],[24,4,25,12]]}
[null,null,null,null,"SELECT ALL CHOICES BELOW FOR THE PROPOSED SYSTEM "]
[null,null,null,null,"RESULT IS LISTED AT BOTTOM"]
[]
[]
[]
[]
[]
[]
[]
[]
[]
[null,"APX 8500 Frequency Band Information",null,null,null,{"$f":"IF(Lookups!$K$16,\"ERROR: Please Check BANDS used by APX\",\"\")","v":""}]
[null,null,null,null,null,{"$f":"IF(Lookups!$P$17,\"ERROR: Please Check APX BAND where VR will be Used\",\"\")","v":""}]
[null,null,null,null,null,{"$f":"IF(Lookups!$P$16,\"ERROR: A Band chosen for APX-VR Repeat is not an APX Band\",\"\")","v":""}]
[]
[]
[]
[]
[null,null,null,null,null,null,null,null,null,null,"REFERENCE CONFIG:",{"$f":"Lookups!$B$16","v":543}]
[null,null,null,null,null,null,null,null,null,null,"FILTER TYPE:",{"$f":"Lookups!$M$29","v":14}]
[]
[]
[null,"REQUIRED FILTERING SOLUTION"]
[]
[null,null,null,"VR & APX Description:",{"$f":"Lookups!$M$28","v":"VRX1000 (VHF) Inband & Crossband; For APX (VHF+UHF+700+800) using Single-Band Antenna(s)"}]
[]
[null,"FILTERING REQUIRED (Listed Below)"]
[null,null,null,"FILTER DESCRIPTION:",{"$f":"Lookups!$M$30","v":"IN-BAND FILTER PACKAGE & APX Antenna TRIPLEXER"}]
[null,null,null,"ANTENNA NOTES:",{"$f":"Lookups!$M$31","v":"N/A"}]
[]
[null,null,null,"DRAWING NUMBER:",{"$f":"IF(VRcode=2,\"No Drawing\",Lookups!$M$33)","v":"No Drawing"}]
[]
[null,"ORDER THESE FILTERING KITS:"]
[null,"Quantity","Order Code",null,"Description"]
[null,{"$f":"VLOOKUP(FILTER_Code,AntennaFilters,5)","v":1},"See Order Guide",null,"In-Band Filtering Package (Mandatory unless '0' quantity shown)"]
[null,{"$f":"VLOOKUP(FILTER_Code,AntennaFilters,6)","v":1},{"$f":"IF(B36=1,\"QA09450AA\",\"\")","v":"QA09450AA"},null,"Antenna Triplexer (Required for APX Radio using multiple antennas)"]
[null,{"$f":"VLOOKUP(FILTER_Code,AntennaFilters,8)","v":0},{"$f":"IF(AND(B37=1,Lookups!B3=2,Lookups!F3=1), \"QA09450AA\", IF(AND(B37=1, Lookups!B3=1),\"QA09482AA\",\"\"))","v":""},null,"Single Triplexer & Bypass Relay Kit"]
[null,{"$f":"VLOOKUP(FILTER_Code,AntennaFilters,9)","v":0},{"$f":"IF(AND(B38=1,Lookups!R3=TRUE,Lookups!S3=TRUE),\"QA09448AA\",IF(AND(B38=1,Lookups!R4=TRUE,Lookups!S4=TRUE),\"QA09448AA\",IF(AND(B38=1,Lookups!R6=TRUE,Lookups!S6=TRUE),\"QA09448AA\",IF(AND(B38=1,Lookups!R3=FALSE),\"QA09447AA\",IF(AND(B38=1,Lookups!R4=FALSE),\"QA09447AA\",IF(AND(B38=1,Lookups!R6=FALSE),\"QA09447AA\",\"\"))))))","v":""},null,"Dual Triplexer Kit"]
[null,{"$f":"VLOOKUP(FILTER_Code,AntennaFilters,10)","v":0},{"$f":"IF(AND(B39=1,Lookups!B3=1,Lookups!F3=1),\"QA09487AA\",IF(AND(B39=1,Lookups!B3=1,Lookups!F3=2),\"QA09488AA\",IF(AND(B39=1,Lookups!B3=1,Lookups!F3=3),\"QA09488AA\",IF(AND(B39=1,Lookups!B3=1,Lookups!F3=4),\"QA09445AA\",IF(AND(B39=1,Lookups!B3=1,Lookups!F3=5),\"QA09455AA\",IF(AND(B39=1,Lookups!B3=1,Lookups!F3=6),\"QA09455AA\",IF(AND(B39=1,Lookups!B3=2,Lookups!F3=1),\"QA09489AA\",IF(AND(B39=1,Lookups!B3=2,Lookups!F3=2),\"QA09490AA\",IF(AND(B39=1,Lookups!B3=2,Lookups!F3=3),\"QA09490AA\",IF(AND(B39=1,Lookups!B3=2,Lookups!F3=4),\"QA09491AA\",IF(AND(B39=1,Lookups!B3=2,Lookups!F3=5),\"QA09491AA\",IF(AND(B39=1,Lookups!B3=2,Lookups!F3=6),\"QA09491AA\",\"\"))))))))))))","v":""},null,"Dual Triplexers & Bypass Relay Kit"]
[null,{"$f":"VLOOKUP(FILTER_Code,AntennaFilters,11)","v":0},{"$f":"IF(AND(B40=1,Lookups!B3=1,Lookups!R3=FALSE),\"QA09446AA\",IF(AND(B40=1,Lookups!B3=2,Lookups!S3=TRUE),\"Kit#TBD1\",IF(AND(B40=1,Lookups!B3=2,Lookups!S4=TRUE),\"Kit#TBD1\",IF(AND(B40=1,Lookups!B3=2,Lookups!S6=TRUE),\"Kit#TBD1\",IF(AND(B40=1,Lookups!B3=2,Lookups!S3=TRUE),\"Kit#TBD2\",\"\")))))","v":""},null,"Filter Bypass Relay Kit"]
[null,{"$f":"VLOOKUP(FILTER_Code,AntennaFilters,14)","v":0},"Special",null,"SPECIAL ORDER - Engineering Review and Quote Required from Futurecom"]
[]
[null,"Form Rev:","2023-12-21"]
[null,"Form Ver.",3]

{"sheet":"VRX SOLUTIONS","index":1,"n_rows":378,"n_cols":25,"rows_kept":378,"cut":false,"hidden":true,"merged":[[2,6,2,7]]}
[null,null,null,null,null,null,null,null,"VRX FILTERING CONFIGURATOR"]
["SOLUTIONS REQUIRED"]
[null,"Kit-1","Kit-2","Kit-3","KIT-4","KIT-0","Kit-5",null,"VRX",null,null,null,null,null,null,null,null,"Lookup/Sorting Codes",null,null,null,null,"FilterCode"]
[1,2,3,4,5,6,6,10,null,"VRX","MSU FREQUENCY BANDS USED",null,null,null,"MSU "]
[null,"TRIPLEXER SOLUTION",null,null,null,"STANDARD","OPTION","Required","NOTES","BAND","b1","b2","b3a","b3b","ANT","REPEAT",null,4,16,4,2]
["NONE","1x","1x+Relay","2x","2x+Relay","In-BAND","Relay","Relay","NOTES","VRX1000 ","VHF","UHF",700,800,"MSU-Ant","TYPE","DESCRIPTION","VRF","MRF","RPT","ANT","TOTAl","FL","NumBands","Drawing"]
[null,"X",null,null,null,null,null,null,null,"VHF",null,"X",null,null,"SINGLE","XB-Forced",{"$f":"$J$6&\"(\"&$J7&\")\"&\" \"&VLOOKUP($P7,RPTCodes,2,FALSE) &\"; For APX (\"&VLOOKUP($S7,BAND_NAMES,2)&\") using \"&VLOOKUP($O7,ANTcodes,3,FALSE)","v":"VRX1000 (VHF) Crossband; For APX (UHF) using Single-Band Antenna(s)"},{"$f":"VLOOKUP(J7,Freq_Bands,2)","v":1},{"$f":"IF(K7=\"X\",1,0)+IF(L7=\"X\",2,0)+IF(M7=\"X\",4,0)+IF(N7=\"X\",8,0)","v":2},{"$f":"VLOOKUP(P7,RPTCodes,4,FALSE)","v":4},{"$f":"VLOOKUP(O7,ANTcodes,2,FALSE)","v":0},{"$f":"$U7*MULT_ANT+$T7*MULT_RPT+$S7*MULT_MRF+$R7*MULT_VRF","v":319},{"$f":"IF($A7=\"X\",1,0)+IF($B7=\"X\",2,0)+IF($C7=\"X\",3,0)+IF($D7=\"X\",4,0)+IF($E7=\"X\",5,0)+IF($F7=\"X\",6,0)+IF($H7=\"X\",10,0)+IF($G7=\"X\",6,0)","v":2},{"$f":"COUNTA(K7:L7)+IF(RIGHT(M7&N7,1)=\"X\",1,0)","v":1},"No Drawing"]
[null,"X",null,null,null,null,null,null,null,"VHF",null,"X",null,null,"ALL","XB-Forced","VRX1000 (VHF) Crossband; For APX (UHF) using One All-Band Antenna",1,2,4,1,320,2,1,"No Drawing"]
[null,"X",null,null,null,null,null,null,null,"VHF",null,"X",null,null,"USER","XB-Forced","VRX1000 (VHF) Crossband; For APX (UHF) using Unknown or User-Defined Antenna",1,2,4,2,321,2,1,"No Drawing"]
[null,"X",null,null,null,null,null,null,null,"VHF",null,null,"X",null,"SINGLE","XB-Forced","VRX1000 (VHF) Crossband; For APX (700) using Single-Band Antenna(s)",1,4,4,0,353,2,1,"No Drawing"]
[null,"X",null,null,null,null,null,null,null,"VHF",null,null,"X",null,"ALL","XB-Forced","VRX1000 (VHF) Crossband; For APX (700) using One All-Band Antenna",1,4,4,1,354,2,1,"No Drawing"]
[null,"X",null,null,null,null,null,null,null,"VHF",null,null,"X",null,"USER","XB-Forced","VRX1000 (VHF) Crossband; For APX (700) using Unknown or User-Defined Antenna",1,4,4,2,355,2,1,"No Drawing"]
[null,"X",null,null,null,null,null,null,null,"VHF",null,"X","X",null,"SINGLE","XB-Forced","VRX1000 (VHF) Crossband; For APX (UHF+700) using Single-Band Antenna(s)",1,6,4,0,387,2,2,"No Drawing"]
[null,"X",null,null,null,null,null,null,null,"VHF",null,null,null,"X","SINGLE","XB-Forced","VRX1000 (VHF) Crossband; For APX (800) using Single-Band Antenna(s)",1,8,4,0,421,2,1,"No Drawing"]
[null,"X",null,null,null,null,null,null,null,"VHF",null,null,null,"X","ALL","XB-Forced","VRX1000 (VHF) Crossband; For APX (800) using One All-Band Antenna",1,8,4,1,422,2,1,"No Drawing"]
[null,"X",null,null,null,null,null,null,null,"VHF",null,null,null,"X","USER","XB-Forced","VRX1000 (VHF) Crossband; For APX (800) using Unknown or User-Defined Antenna",1,8,4,2,423,2,1,"No Drawing"]
[null,"X",null,null,null,null,null,null,null,"VHF",null,"X",null,"X","SINGLE","XB-Forced","VRX1000 (VHF) Crossband; For APX (UHF+800) using Single-Band Antenna(s)",1,10,4,0,455,2,2,"No Drawing"]
[null,"X",null,null,null,null,null,null,null,"VHF",null,null,"X","X","SINGLE","XB-Forced","VRX1000 (VHF) Crossband; For APX (700+800) using Single-Band Antenna(s)",1,12,4,0,489,2,1,"No Drawing"]
[null,"X",null,null,null,null,null,null,null,"VHF",null,null,"X","X","ALL","XB-Forced","VRX1000 (VHF) Crossband; For APX (700+800) using One All-Band Antenna",1,12,4,1,490,2,1,"No Drawing"]
[null,"X",null,null,null,null,null,null,null,"VHF",null,null,"X","X","USER","XB-Forced","VRX1000 (VHF) Crossband; For APX (700+800) using Unknown or User-Defined Antenna",1,12,4,2,491,2,1,"No Drawing"]
[null,"X",null,null,null,null,null,null,null,"VHF",null,"X","X","X","SINGLE","XB-Forced","VRX1000 (VHF) Crossband; For APX (UHF+700+800) using Single-Band Antenna(s)",1,14,4,0,523,2,2,"No Drawing"]
[null,"X",null,null,null,null,null,null,null,"UHF","X",null,null,null,"SINGLE","XB-Forced","VRX1000 (UHF) Crossband; For APX (VHF) using Single-Band Antenna(s)",2,1,4,0,575,2,1,"No Drawing"]
[null,"X",null,null,null,null,null,null,null,"UHF","X",null,null,null,"ALL","XB-Forced","VRX1000 (UHF) Crossband; For APX (VHF) using One All-Band Antenna",2,1,4,1,576,2,1,"No Drawing"]
[null,"X",null,null,null,null,null,null,null,"UHF","X",null,null,null,"USER","XB-Forced","VRX1000 (UHF) Crossband; For APX (VHF) using Unknown or User-Defined Antenna",2,1,4,2,577,2,1,"No Drawing"]
[null,"X",null,null,null,null,null,null,null,"UHF",null,null,"X",null,"SINGLE","XB-Forced","VRX1000 (UHF) Crossband; For APX (700) using Single-Band Antenna(s)",2,4,4,0,626,2,1,"No Drawing"]
[null,"X",null,null,null,null,null,null,null,"UHF",null,null,"X",null,"ALL","XB-Forced","VRX1000 (UHF) Crossband; For APX (700) using One All-Band Antenna",2,4,4,1,627,2,1,"No Drawing"]
[null,"X",null,null,null,null,null,null,null,"UHF",null,null,"X",null,"USER","XB-Forced","VRX1000 (UHF) Crossband; For APX (700) using Unknown or User-Defined Antenna",2,4,4,2,628,2,1,"No Drawing"]
[null,"X",null,null,null,null,null,null,null,"UHF","X",null,"X",null,"SINGLE","XB-Forced","VRX1000 (UHF) Crossband; For APX (VHF+700) using Single-Band Antenna(s)",2,5,4,0,643,2,2,"No Drawing"]
[null,"X",null,null,null,null,null,null,null,"UHF",null,null,null,"X","SINGLE","XB-Forced","VRX1000 (UHF) Crossband; For APX (800) using Single-Band Antenna(s)",2,8,4,0,694,2,1,"No Drawing"]
[null,"X",null,null,null,null,null,null,null,"UHF",null,null,null,"X","ALL","XB-Forced","VRX1000 (UHF) Crossband; For APX (800) using One All-Band Antenna",2,8,4,1,695,2,1,"No Drawing"]
[null,"X",null,null,null,null,null,null,null,"UHF",null,null,null,"X","USER","XB-Forced","VRX1000 (UHF) Crossband; For APX (800) using Unknown or User-Defined Antenna",2,8,4,2,696,2,1,"No Drawing"]
[null,"X",null,null,null,null,null,null,null,"UHF","X",null,null,"X","SINGLE","XB-Forced","VRX1000 (UHF) Crossband; For APX (VHF+800) using Single-Band Antenna(s)",2,9,4,0,711,2,2,"No Drawing"]
[null,"X",null,null,null,null,null,null,null,"UHF",null,null,"X","X","SINGLE","XB-Forced","VRX1000 (UHF) Crossband; For APX (700+800) using Single-Band Antenna(s)",2,12,4,0,762,2,1,"No Drawing"]
[null,"X",null,null,null,null,null,null,null,"UHF",null,null,"X","X","ALL","XB-Forced","VRX1000 (UHF) Crossband; For APX (700+800) using One All-Band Antenna",2,12,4,1,763,2,1,"No Drawing"]
[null,"X",null,null,null,null,null,null,null,"UHF",null,null,"X","X","USER","XB-Forced","VRX1000 (UHF) Crossband; For APX (700+800) using Unknown or User-Defined Antenna",2,12,4,2,764,2,1,"No Drawing"]
[null,"X",null,null,null,null,null,null,null,"UHF","X",null,"X","X","SINGLE","XB-Forced","VRX1000 (UHF) Crossband; For APX (VHF+700+800) using Single-Band Antenna(s)",2,13,4,0,779,2,2,"No Drawing"]
[null,"X",null,null,null,null,null,null,null,700,"X",null,null,null,"SINGLE","XB-Forced","VRX1000 (700) Crossband; For APX (VHF) using Single-Band Antenna(s)",3,1,4,0,848,2,1,"No Drawing"]
[null,"X",null,null,null,null,null,null,null,700,"X",null,null,null,"ALL","XB-Forced","VRX1000 (700) Crossband; For APX (VHF) using One All-Band Antenna",3,1,4,1,849,2,1,"No Drawing"]
[null,"X",null,null,null,null,null,null,null,700,"X",null,null,null,"USER","XB-Forced","VRX1000 (700) Crossband; For APX (VHF) using Unknown or User-Defined Antenna",3,1,4,2,850,2,1,"No Drawing"]
[null,"X",null,null,null,null,null,null,null,700,null,"X",null,null,"SINGLE","XB-Forced","VRX1000 (700) Crossband; For APX (UHF) using Single-Band Antenna(s)",3,2,4,0,865,2,1,"No Drawing"]
[null,"X",null,null,null,null,null,null,null,700,null,"X",null,null,"ALL","XB-Forced","VRX1000 (700) Crossband; For APX (UHF) using One All-Band Antenna",3,2,4,1,866,2,1,"No Drawing"]
[null,"X",null,null,null,null,null,null,null,700,null,"X",null,null,"USER","XB-Forced","VRX1000 (700) Crossband; For APX (UHF) using Unknown or User-Defined Antenna",3,2,4,2,867,2,1,"No Drawing"]
[null,"X",null,null,null,null,null,null,null,700,"X","X",null,null,"SINGLE","XB-Forced","VRX1000 (700) Crossband; For APX (VHF+UHF) using Single-Band Antenna(s)",3,3,4,0,882,2,2,"No Drawing"]
[null,"X",null,null,null,null,null,null,null,800,"X",null,null,null,"SINGLE","XB-Forced","VRX1000 (800) Crossband; For APX (VHF) using Single-Band Antenna(s)",4,1,4,0,1121,2,1,"No Drawing"]
[null,"X",null,null,null,null,null,null,null,800,"X",null,null,null,"ALL","XB-Forced","VRX1000 (800) Crossband; For APX (VHF) using One All-Band Antenna",4,1,4,1,1122,2,1,"No Drawing"]
[null,"X",null,null,null,null,null,null,null,800,"X",null,null,null,"USER","XB-Forced","VRX1000 (800) Crossband; For APX (VHF) using Unknown or User-Defined Antenna",4,1,4,2,1123,2,1,"No Drawing"]
[null,"X",null,null,null,null,null,null,null,800,null,"X",null,null,"SINGLE","XB-Forced","VRX1000 (800) Crossband; For APX (UHF) using Single-Band Antenna(s)",4,2,4,0,1138,2,1,"No Drawing"]
[null,"X",null,null,null,null,null,null,null,800,null,"X",null,null,"ALL","XB-Forced","VRX1000 (800) Crossband; For APX (UHF) using One All-Band Antenna",4,2,4,1,1139,2,1,"No Drawing"]
[null,"X",null,null,null,null,null,null,null,800,null,"X",null,null,"USER","XB-Forced","VRX1000 (800) Crossband; For APX (UHF) using Unknown or User-Defined Antenna",4,2,4,2,1140,2,1,"No Drawing"]
[null,"X",null,null,null,null,null,null,null,800,"X","X",null,null,"SINGLE","XB-Forced","VRX1000 (800) Crossband; For APX (VHF+UHF) using Single-Band Antenna(s)",4,3,4,0,1155,2,2,"No Drawing"]
[null,null,"X",null,null,null,null,null,null,"VHF","X","X",null,null,"ALL","XB-Only","VRX1000 (VHF) Crossband/No Inband; For APX (VHF+UHF) using One All-Band Antenna",1,3,3,1,334,3,2,"8J087X51-07"]
[null,null,"X",null,null,null,null,null,null,"VHF","X","X",null,null,"USER","XB-Only","VRX1000 (VHF) Crossband/No Inband; For APX (VHF+UHF) using Unknown or User-Defined Antenna",1,3,3,2,335,3,2,"No Drawing"]
[null,null,"X",null,null,null,null,null,null,"VHF","X",null,"X",null,"ALL","XB-Only","VRX1000 (VHF) Crossband/No Inband; For APX (VHF+700) using One All-Band Antenna",1,5,3,1,368,3,2,"8J087X51-08"]
[null,null,"X",null,null,null,null,null,null,"VHF","X",null,"X",null,"USER","XB-Only","VRX1000 (VHF) Crossband/No Inband; For APX (VHF+700) using Unknown or User-Defined Antenna",1,5,3,2,369,3,2,"No Drawing"]
[null,null,"X",null,null,null,null,null,null,"VHF","X",null,null,"X","ALL","XB-Only","VRX1000 (VHF) Crossband/No Inband; For APX (VHF+800) using One All-Band Antenna",1,9,3,1,436,3,2,"8J087X51-08"]
[null,null,"X",null,null,null,null,null,null,"VHF","X",null,null,"X","USER","XB-Only","VRX1000 (VHF) Crossband/No Inband; For APX (VHF+800) using Unknown or User-Defined Antenna",1,9,3,2,437,3,2,"No Drawing"]
[null,null,"X",null,null,null,null,null,null,"VHF","X",null,"X","X","ALL","XB-Only","VRX1000 (VHF) Crossband/No Inband; For APX (VHF+700+800) using One All-Band Antenna",1,13,3,1,504,3,2,"8J087X51-08"]
[null,null,"X",null,null,null,null,null,null,"VHF","X",null,"X","X","USER","XB-Only","VRX1000 (VHF) Crossband/No Inband; For APX (VHF+700+800) using Unknown or User-Defined Antenna",1,13,3,2,505,3,2,"No Drawing"]
[null,null,"X",null,null,null,null,null,null,"UHF","X","X",null,null,"ALL","XB-Only","VRX1000 (UHF) Crossband/No Inband; For APX (VHF+UHF) using One All-Band Antenna",2,3,3,1,607,3,2,"8J087X51-09"]
[null,null,"X",null,null,null,null,null,null,"UHF","X","X",null,null,"USER","XB-Only","VRX1000 (UHF) Crossband/No Inband; For APX (VHF+UHF) using Unknown or User-Defined Antenna",2,3,3,2,608,3,2,"No Drawing"]
[null,null,"X",null,null,null,null,null,null,"UHF",null,"X","X",null,"ALL","XB-Only","VRX1000 (UHF) Crossband/No Inband; For APX (UHF+700) using One All-Band Antenna",2,6,3,1,658,3,2,"8J087X51-10"]
[null,null,"X",null,null,null,null,null,null,"UHF",null,"X","X",null,"USER","XB-Only","VRX1000 (UHF) Crossband/No Inband; For APX (UHF+700) using Unknown or User-Defined Antenna",2,6,3,2,659,3,2,"No Drawing"]
[null,null,"X",null,null,null,null,null,null,"UHF",null,"X",null,"X","ALL","XB-Only","VRX1000 (UHF) Crossband/No Inband; For APX (UHF+800) using One All-Band Antenna",2,10,3,1,726,3,2,"8J087X51-10"]
[null,null,"X",null,null,null,null,null,null,"UHF",null,"X",null,"X","USER","XB-Only","VRX1000 (UHF) Crossband/No Inband; For APX (UHF+800) using Unknown or User-Defined Antenna",2,10,3,2,727,3,2,"No Drawing"]
[null,null,"X",null,null,null,null,null,null,"UHF",null,"X","X","X","ALL","XB-Only","VRX1000 (UHF) Crossband/No Inband; For APX (UHF+700+800) using One All-Band Antenna",2,14,3,1,794,3,2,"8J087X51-10"]
[null,null,"X",null,null,null,null,null,null,"UHF",null,"X","X","X","USER","XB-Only","VRX1000 (UHF) Crossband/No Inband; For APX (UHF+700+800) using Unknown or User-Defined Antenna",2,14,3,2,795,3,2,"No Drawing"]
[null,null,"X",null,null,null,null,null,null,700,"X",null,"X",null,"ALL","XB-Only","VRX1000 (700) Crossband/No Inband; For APX (VHF+700) using One All-Band Antenna",3,5,3,1,914,3,2,"8J087X51-11"]
[null,null,"X",null,null,null,null,null,null,700,"X",null,"X",null,"USER","XB-Only","VRX1000 (700) Crossband/No Inband; For APX (VHF+700) using Unknown or User-Defined Antenna",3,5,3,2,915,3,2,"No Drawing"]
[null,null,"X",null,null,null,null,null,null,700,null,"X","X",null,"ALL","XB-Only","VRX1000 (700) Crossband/No Inband; For APX (UHF+700) using One All-Band Antenna",3,6,3,1,931,3,2,"8J087X51-12"]
[null,null,"X",null,null,null,null,null,null,700,null,"X","X",null,"USER","XB-Only","VRX1000 (700) Crossband/No Inband; For APX (UHF+700) using Unknown or User-Defined Antenna",3,6,3,2,932,3,2,"No Drawing"]
[null,null,"X",null,null,null,null,null,null,700,"X",null,null,"X","ALL","XB-Only",{"$f":"$J$6&\"(\"&$J71&\")\"&\" \"&VLOOKUP($P71,RPTCodes,2,FALSE) &\"; For APX (\"&VLOOKUP($S71,BAND_NAMES,2)&\") using \"&VLOOKUP($O71,ANTcodes,3,FALSE)","v":"VRX1000 (700) Crossband/No Inband; For APX (VHF+800) using One All-Band Antenna"},{"$f":"VLOOKUP(J71,Freq_Bands,2)","v":3},{"$f":"IF(K71=\"X\",1,0)+IF(L71=\"X\",2,0)+IF(M71=\"X\",4,0)+IF(N71=\"X\",8,0)","v":9},{"$f":"VLOOKUP(P71,RPTCodes,4,FALSE)","v":3},{"$f":"VLOOKUP(O71,ANTcodes,2,FALSE)","v":1},{"$f":"$U71*MULT_ANT+$T71*MULT_RPT+$S71*MULT_MRF+$R71*MULT_VRF","v":982},{"$f":"IF($A71=\"X\",1,0)+IF($B71=\"X\",2,0)+IF($C71=\"X\",3,0)+IF($D71=\"X\",4,0)+IF($E71=\"X\",5,0)+IF($F71=\"X\",6,0)+IF($H71=\"X\",10,0)+IF($G71=\"X\",6,0)","v":3},{"$f":"COUNTA(K71:L71)+IF(RIGHT(M71&N71,1)=\"X\",1,0)","v":2},"8J087X51-11"]
[null,null,"X",null,null,null,null,null,null,700,"X",null,null,"X","USER","XB-Only","VRX1000 (700) Crossband/No Inband; For APX (VHF+800) using Unknown or User-Defined Antenna",3,9,3,2,983,3,2,"No Drawing"]
[null,null,"X",null,null,null,null,null,null,700,null,"X",null,"X","ALL","XB-Only","VRX1000 (700) Crossband/No Inband; For APX (UHF+800) using One All-Band Antenna",3,10,3,1,999,3,2,"8J087X51-12"]
[null,null,"X",null,null,null,null,null,null,700,null,"X",null,"X","USER","XB-Only","VRX1000 (700) Crossband/No Inband; For APX (UHF+800) using Unknown or User-Defined Antenna",3,10,3,2,1000,3,2,"No Drawing"]
[null,null,"X",null,null,null,null,null,null,700,"X",null,"X","X","ALL","XB-Only","VRX1000 (700) Crossband/No Inband; For APX (VHF+700+800) using One All-Band Antenna",3,13,3,1,1050,3,2,"8J087X51-11"]
[null,null,"X",null,null,null,null,null,null,700,"X",null,"X","X","USER","XB-Only","VRX1000 (700) Crossband/No Inband; For APX (VHF+700+800) using Unknown or User-Defined Antenna",3,13,3,2,1051,3,2,"No Drawing"]
[null,null,"X",null,null,null,null,null,null,700,null,"X","X","X","ALL","XB-Only","VRX1000 (700) Crossband/No Inband; For APX (UHF+700+800) using One All-Band Antenna",3,14,3,1,1067,3,2,"8J087X51-12"]
[null,null,"X",null,null,null,null,null,null,700,null,"X","X","X","USER","XB-Only","VRX1000 (700) Crossband/No Inband; For APX (UHF+700+800) using Unknown or User-Defined Antenna",3,14,3,2,1068,3,2,"No Drawing"]
[null,null,"X",null,null,null,null,null,null,800,"X",null,"X",null,"ALL","XB-Only","VRX1000 (800) Crossband/No Inband; For APX (VHF+700) using One All-Band Antenna",4,5,3,1,1187,3,2,"8J087X51-11"]
[null,null,"X",null,null,null,null,null,null,800,"X",null,"X",null,"USER","XB-Only","VRX1000 (800) Crossband/No Inband; For APX (VHF+700) using Unknown or User-Defined Antenna",4,5,3,2,1188,3,2,"No Drawing"]
[null,null,"X",null,null,null,null,null,null,800,null,"X","X",null,"ALL","XB-Only","VRX1000 (800) Crossband/No Inband; For APX (UHF+700) using One All-Band Antenna",4,6,3,1,1204,3,2,"8J087X51-12"]
[null,null,"X",null,null,null,null,null,null,800,null,"X","X",null,"USER","XB-Only","VRX1000 (800) Crossband/No Inband; For APX (UHF+700) using Unknown or User-Defined Antenna",4,6,3,2,1205,3,2,"No Drawing"]
[null,null,"X",null,null,null,null,null,null,800,"X",null,null,"X","ALL","XB-Only","VRX1000 (800) Crossband/No Inband; For APX (VHF+800) using One All-Band Antenna",4,9,3,1,1255,3,2,"8J087X51-11"]
[null,null,"X",null,null,null,null,null,null,800,"X",null,null,"X","USER","XB-Only","VRX1000 (800) Crossband/No Inband; For APX (VHF+800) using Unknown or User-Defined Antenna",4,9,3,2,1256,3,2,"No Drawing"]
[null,null,"X",null,null,null,null,null,null,800,null,"X",null,"X","ALL","XB-Only","VRX1000 (800) Crossband/No Inband; For APX (UHF+800) using One All-Band Antenna",4,10,3,1,1272,3,2,"8J087X51-12"]
[null,null,"X",null,null,null,null,null,null,800,null,"X",null,"X","USER","XB-Only","VRX1000 (800) Crossband/No Inband; For APX (UHF+800) using Unknown or User-Defined Antenna",4,10,3,2,1273,3,2,"No Drawing"]
[null,null,"X",null,null,null,null,null,null,800,"X",null,"X","X","ALL","XB-Only","VRX1000 (800) Crossband/No Inband; For APX (VHF+700+800) using One All-Band Antenna",4,13,3,1,1323,3,2,"8J087X51-11"]
[null,null,"X",null,null,null,null,null,null,800,"X",null,"X","X","USER","XB-Only","VRX1000 (800) Crossband/No Inband; For APX (VHF+700+800) using Unknown or User-Defined Antenna",4,13,3,2,1324,3,2,"No Drawing"]
[null,null,"X",null,null,null,null,null,null,800,null,"X","X","X","ALL","XB-Only","VRX1000 (800) Crossband/No Inband; For APX (UHF+700+800) using One All-Band Antenna",4,14,3,1,1340,3,2,"8J087X51-12"]
[null,null,"X",null,null,null,null,null,null,800,null,"X","X","X","USER","XB-Only","VRX1000 (800) Crossband/No Inband; For APX (UHF+700+800) using Unknown or User-Defined Antenna",4,14,3,2,1341,3,2,"No Drawing"]
[null,null,null,"X",null,null,null,null,null,"VHF",null,"X","X",null,"ALL","XB-Forced","VRX1000 (VHF) Crossband; For APX (UHF+700) using One All-Band Antenna",1,6,4,1,388,4,2,"8J087X51-13"]
[null,null,null,"X",null,null,null,null,null,"VHF",null,"X","X",null,"USER","XB-Forced","VRX1000 (VHF) Crossband; For APX (UHF+700) using Unknown or User-Defined Antenna",1,6,4,2,389,4,2,"No Drawing"]
[null,null,null,"X",null,null,null,null,null,"VHF",null,"X",null,"X","ALL","XB-Forced","VRX1000 (VHF) Crossband; For APX (UHF+800) using One All-Band Antenna",1,10,4,1,456,4,2,"8J087X51-13"]
[null,null,null,"X",null,null,null,null,null,"VHF",null,"X",null,"X","USER","XB-Forced","VRX1000 (VHF) Crossband; For APX (UHF+800) using Unknown or User-Defined Antenna",1,10,4,2,457,4,2,"No Drawing"]
[null,null,null,"X",null,null,null,null,null,"VHF",null,"X","X","X","ALL","XB-Forced","VRX1000 (VHF) Crossband; For APX (UHF+700+800) using One All-Band Antenna",1,14,4,1,524,4,2,"8J087X51-13"]
[null,null,null,"X",null,null,null,null,null,"VHF",null,"X","X","X","USER","XB-Forced","VRX1000 (VHF) Crossband; For APX (UHF+700+800) using Unknown or User-Defined Antenna",1,14,4,2,525,4,2,"No Drawing"]
[null,null,null,"X",null,null,null,null,null,"UHF","X",null,"X",null,"ALL","XB-Forced","VRX1000 (UHF) Crossband; For APX (VHF+700) using One All-Band Antenna",2,5,4,1,644,4,2,"8J087X51-14"]
[null,null,null,"X",null,null,null,null,null,"UHF","X",null,"X",null,"USER","XB-Forced","VRX1000 (UHF) Crossband; For APX (VHF+700) using Unknown or User-Defined Antenna",2,5,4,2,645,4,2,"No Drawing"]
[null,null,null,"X",null,null,null,null,null,"UHF","X",null,null,"X","ALL","XB-Forced","VRX1000 (UHF) Crossband; For APX (VHF+800) using One All-Band Antenna",2,9,4,1,712,4,2,"8J087X51-14"]
[null,null,null,"X",null,null,null,null,null,"UHF","X",null,null,"X","USER","XB-Forced","VRX1000 (UHF) Crossband; For APX (VHF+800) using Unknown or User-Defined Antenna",2,9,4,2,713,4,2,"No Drawing"]
[null,null,null,"X",null,null,null,null,null,"UHF","X",null,"X","X","ALL","XB-Forced","VRX1000 (UHF) Crossband; For APX (VHF+700+800) using One All-Band Antenna",2,13,4,1,780,4,2,"8J087X51-14"]
[null,null,null,"X",null,null,null,null,null,"UHF","X",null,"X","X","USER","XB-Forced","VRX1000 (UHF) Crossband; For APX (VHF+700+800) using Unknown or User-Defined Antenna",2,13,4,2,781,4,2,"No Drawing"]
[null,null,null,"X",null,null,null,null,null,700,"X","X",null,null,"ALL","XB-Forced","VRX1000 (700) Crossband; For APX (VHF+UHF) using One All-Band Antenna",3,3,4,1,883,4,2,"8J087X51-15"]
[null,null,null,"X",null,null,null,null,null,700,"X","X",null,null,"USER","XB-Forced","VRX1000 (700) Crossband; For APX (VHF+UHF) using Unknown or User-Defined Antenna",3,3,4,2,884,4,2,"No Drawing"]
[null,null,null,"X",null,null,null,null,null,800,"X","X",null,null,"ALL","XB-Forced","VRX1000 (800) Crossband; For APX (VHF+UHF) using One All-Band Antenna",4,3,4,1,1156,4,2,"8J087X51-15"]
[null,null,null,"X",null,null,null,null,null,800,"X","X",null,null,"USER","XB-Forced","VRX1000 (800) Crossband; For APX (VHF+UHF) using Unknown or User-Defined Antenna",4,3,4,2,1157,4,2,"No Drawing"]
[null,null,null,null,"X",null,null,null,null,"VHF","X","X","X",null,"ALL","XB-Only","VRX1000 (VHF) Crossband/No Inband; For APX (VHF+UHF+700) using One All-Band Antenna",1,7,3,1,402,5,3,"8J087X51-40"]
[null,null,null,null,"X",null,null,null,null,"VHF","X","X","X",null,"USER","XB-Only","VRX1000 (VHF) Crossband/No Inband; For APX (VHF+UHF+700) using Unknown or User-Defined Antenna",1,7,3,2,403,5,3,"No Drawing"]
[null,null,null,null,"X",null,null,null,null,"VHF","X","X",null,"X","ALL","XB-Only","VRX1000 (VHF) Crossband/No Inband; For APX (VHF+UHF+800) using One All-Band Antenna",1,11,3,1,470,5,3,"8J087X51-40"]
[null,null,null,null,"X",null,null,null,null,"VHF","X","X",null,"X","USER","XB-Only","VRX1000 (VHF) Crossband/No Inband; For APX (VHF+UHF+800) using Unknown or User-Defined Antenna",1,11,3,2,471,5,3,"No Drawing"]
[null,null,null,null,"X",null,null,null,null,"VHF","X","X","X","X","ALL","XB-Only","VRX1000 (VHF) Crossband/No Inband; For APX (VHF+UHF+700+800) using One All-Band Antenna",1,15,3,1,538,5,3,"8J087X51-40"]
[null,null,null,null,"X",null,null,null,null,"VHF","X","X","X","X","USER","XB-Only","VRX1000 (VHF) Crossband/No Inband; For APX (VHF+UHF+700+800) using Unknown or User-Defined Antenna",1,15,3,2,539,5,3,"No Drawing"]
[null,null,null,null,"X",null,null,null,null,"UHF","X","X","X",null,"ALL","XB-Only","VRX1000 (UHF) Crossband/No Inband; For APX (VHF+UHF+700) using One All-Band Antenna",2,7,3,1,675,5,3,"8J087X51-41"]
[null,null,null,null,"X",null,null,null,null,"UHF","X","X","X",null,"USER","XB-Only","VRX1000 (UHF) Crossband/No Inband; For APX (VHF+UHF+700) using Unknown or User-Defined Antenna",2,7,3,2,676,5,3,"No Drawing"]
[null,null,null,null,"X",null,null,null,null,"UHF","X","X",null,"X","ALL","XB-Only","VRX1000 (UHF) Crossband/No Inband; For APX (VHF+UHF+800) using One All-Band Antenna",2,11,3,1,743,5,3,"8J087X51-41"]
[null,null,null,null,"X",null,null,null,null,"UHF","X","X",null,"X","USER","XB-Only","VRX1000 (UHF) Crossband/No Inband; For APX (VHF+UHF+800) using Unknown or User-Defined Antenna",2,11,3,2,744,5,3,"No Drawing"]
[null,null,null,null,"X",null,null,null,null,"UHF","X","X","X","X","ALL","XB-Only","VRX1000 (UHF) Crossband/No Inband; For APX (VHF+UHF+700+800) using One All-Band Antenna",2,15,3,1,811,5,3,"8J087X51-41"]
[null,null,null,null,"X",null,null,null,null,"UHF","X","X","X","X","USER","XB-Only","VRX1000 (UHF) Crossband/No Inband; For APX (VHF+UHF+700+800) using Unknown or User-Defined Antenna",2,15,3,2,812,5,3,"No Drawing"]
[null,null,null,null,"X",null,null,null,null,700,"X","X","X",null,"ALL","XB-Only","VRX1000 (700) Crossband/No Inband; For APX (VHF+UHF+700) using One All-Band Antenna",3,7,3,1,948,5,3,"8J087X51-42"]
[null,null,null,null,"X",null,null,null,null,700,"X","X","X",null,"USER","XB-Only","VRX1000 (700) Crossband/No Inband; For APX (VHF+UHF+700) using Unknown or User-Defined Antenna",3,7,3,2,949,5,3,"No Drawing"]
[null,null,null,null,"X",null,null,null,null,700,"X","X",null,"X","ALL","XB-Only","VRX1000 (700) Crossband/No Inband; For APX (VHF+UHF+800) using One All-Band Antenna",3,11,3,1,1016,5,3,"8J087X51-42"]
[null,null,null,null,"X",null,null,null,null,700,"X","X",null,"X","USER","XB-Only","VRX1000 (700) Crossband/No Inband; For APX (VHF+UHF+800) using Unknown or User-Defined Antenna",3,11,3,2,1017,5,3,"No Drawing"]
[null,null,null,null,"X",null,null,null,null,700,"X","X","X","X","ALL","XB-Only","VRX1000 (700) Crossband/No Inband; For APX (VHF+UHF+700+800) using One All-Band Antenna",3,15,3,1,1084,5,3,"8J087X51-42"]
[null,null,null,null,"X",null,null,null,null,700,"X","X","X","X","USER","XB-Only","VRX1000 (700) Crossband/No Inband; For APX (VHF+UHF+700+800) using Unknown or User-Defined Antenna",3,15,3,2,1085,5,3,"No Drawing"]
[null,null,null,null,"X",null,null,null,null,800,"X","X","X",null,"ALL","XB-Only","VRX1000 (800) Crossband/No Inband; For APX (VHF+UHF+700) using One All-Band Antenna",4,7,3,1,1221,5,3,"8J087X51-42"]
[null,null,null,null,"X",null,null,null,null,800,"X","X","X",null,"USER","XB-Only","VRX1000 (800) Crossband/No Inband; For APX (VHF+UHF+700) using Unknown or User-Defined Antenna",4,7,3,2,1222,5,3,"No Drawing"]
[null,null,null,null,"X",null,null,null,null,800,"X","X",null,"X","ALL","XB-Only","VRX1000 (800) Crossband/No Inband; For APX (VHF+UHF+800) using One All-Band Antenna",4,11,3,1,1289,5,3,"8J087X51-42"]
[null,null,null,null,"X",null,null,null,null,800,"X","X",null,"X","USER","XB-Only","VRX1000 (800) Crossband/No Inband; For APX (VHF+UHF+800) using Unknown or User-Defined Antenna",4,11,3,2,1290,5,3,"No Drawing"]
[null,null,null,null,"X",null,null,null,null,800,"X","X","X","X","ALL","XB-Only","VRX1000 (800) Crossband/No Inband; For APX (VHF+UHF+700+800) using One All-Band Antenna",4,15,3,1,1357,5,3,"8J087X51-42"]
[null,null,null,null,"X",null,null,null,null,800,"X","X","X","X","USER","XB-Only","VRX1000 (800) Crossband/No Inband; For APX (VHF+UHF+700+800) using Unknown or User-Defined Antenna",4,15,3,2,1358,5,3,"No Drawing"]
[null,"X",null,null,null,null,null,"X",null,"VHF","X","X",null,null,"SINGLE","XB-Only","VRX1000 (VHF) Crossband/No Inband; For APX (VHF+UHF) using Single-Band Antenna(s)",1,3,3,0,333,12,2,"8J087X51-49"]
[null,"X",null,null,null,null,null,"X",null,"VHF","X",null,"X",null,"SINGLE","XB-Only","VRX1000 (VHF) Crossband/No Inband; For APX (VHF+700) using Single-Band Antenna(s)",1,5,3,0,367,12,2,"8J087X51-50"]
[null,"X",null,null,null,null,null,"X",null,"VHF","X","X","X",null,"SINGLE","XB-Only","VRX1000 (VHF) Crossband/No Inband; For APX (VHF+UHF+700) using Single-Band Antenna(s)",1,7,3,0,401,12,3,"8J087X51-58"]
[null,"X",null,null,null,null,null,"X",null,"VHF","X",null,null,"X","SINGLE","XB-Only","VRX1000 (VHF) Crossband/No Inband; For APX (VHF+800) using Single-Band Antenna(s)",1,9,3,0,435,12,2,"8J087X51-50"]
[null,"X",null,null,null,null,null,"X",null,"VHF","X","X",null,"X","SINGLE","XB-Only",{"$f":"$J$6&\"(\"&$J135&\")\"&\" \"&VLOOKUP($P135,RPTCodes,2,FALSE) &\"; For APX (\"&VLOOKUP($S135,BAND_NAMES,2)&\") using \"&VLOOKUP($O135,ANTcodes,3,FALSE)","v":"VRX1000 (VHF) Crossband/No Inband; For APX (VHF+UHF+800) using Single-Band Antenna(s)"},{"$f":"VLOOKUP(J135,Freq_Bands,2)","v":1},{"$f":"IF(K135=\"X\",1,0)+IF(L135=\"X\",2,0)+IF(M135=\"X\",4,0)+IF(N135=\"X\",8,0)","v":11},{"$f":"VLOOKUP(P135,RPTCodes,4,FALSE)","v":3},{"$f":"VLOOKUP(O135,ANTcodes,2,FALSE)","v":0},{"$f":"$U135*MULT_ANT+$T135*MULT_RPT+$S135*MULT_MRF+$R135*MULT_VRF","v":469},{"$f":"IF($A135=\"X\",1,0)+IF($B135=\"X\",2,0)+IF($C135=\"X\",3,0)+IF($D135=\"X\",4,0)+IF($E135=\"X\",5,0)+IF($F135=\"X\",6,0)+IF($H135=\"X\",10,0)+IF($G135=\"X\",6,0)","v":12},{"$f":"COUNTA(K135:L135)+IF(RIGHT(M135&N135,1)=\"X\",1,0)","v":3},"8J087X51-58"]
[null,"X",null,null,null,null,null,"X",null,"VHF","X",null,"X","X","SINGLE","XB-Only","VRX1000 (VHF) Crossband/No Inband; For APX (VHF+700+800) using Single-Band Antenna(s)",1,13,3,0,503,12,2,"8J087X51-50"]
[null,"X",null,null,null,null,null,"X",null,"VHF","X","X","X","X","SINGLE","XB-Only","VRX1000 (VHF) Crossband/No Inband; For APX (VHF+UHF+700+800) using Single-Band Antenna(s)",1,15,3,0,537,12,3,"8J087X51-58"]
[null,"X",null,null,null,null,null,"X",null,"UHF","X","X",null,null,"SINGLE","XB-Only","VRX1000 (UHF) Crossband/No Inband; For APX (VHF+UHF) using Single-Band Antenna(s)",2,3,3,0,606,12,2,"8J087X51-51"]
[null,"X",null,null,null,null,null,"X",null,"UHF",null,"X","X",null,"SINGLE","XB-Only","VRX1000 (UHF) Crossband/No Inband; For APX (UHF+700) using Single-Band Antenna(s)",2,6,3,0,657,12,2,"8J087X51-52"]
[null,"X",null,null,null,null,null,"X",null,"UHF","X","X","X",null,"SINGLE","XB-Only","VRX1000 (UHF) Crossband/No Inband; For APX (VHF+UHF+700) using Single-Band Antenna(s)",2,7,3,0,674,12,3,"8J087X51-59"]
[null,"X",null,null,null,null,null,"X",null,"UHF",null,"X",null,"X","SINGLE","XB-Only","VRX1000 (UHF) Crossband/No Inband; For APX (UHF+800) using Single-Band Antenna(s)",2,10,3,0,725,12,2,"8J087X51-52"]
[null,"X",null,null,null,null,null,"X",null,"UHF","X","X",null,"X","SINGLE","XB-Only","VRX1000 (UHF) Crossband/No Inband; For APX (VHF+UHF+800) using Single-Band Antenna(s)",2,11,3,0,742,12,3,"8J087X51-59"]
[null,"X",null,null,null,null,null,"X",null,"UHF",null,"X","X","X","SINGLE","XB-Only","VRX1000 (UHF) Crossband/No Inband; For APX (UHF+700+800) using Single-Band Antenna(s)",2,14,3,0,793,12,2,"8J087X51-52"]
[null,"X",null,null,null,null,null,"X",null,"UHF","X","X","X","X","SINGLE","XB-Only","VRX1000 (UHF) Crossband/No Inband; For APX (VHF+UHF+700+800) using Single-Band Antenna(s)",2,15,3,0,810,12,3,"8J087X51-59"]
[null,"X",null,null,null,null,null,"X",null,700,"X",null,"X",null,"SINGLE","XB-Only","VRX1000 (700) Crossband/No Inband; For APX (VHF+700) using Single-Band Antenna(s)",3,5,3,0,913,12,2,"8J087X51-53"]
[null,"X",null,null,null,null,null,"X",null,700,null,"X","X",null,"SINGLE","XB-Only","VRX1000 (700) Crossband/No Inband; For APX (UHF+700) using Single-Band Antenna(s)",3,6,3,0,930,12,2,"8J087X51-54"]
[null,"X",null,null,null,null,null,"X",null,700,"X","X","X",null,"SINGLE","XB-Only","VRX1000 (700) Crossband/No Inband; For APX (VHF+UHF+700) using Single-Band Antenna(s)",3,7,3,0,947,12,3,"8J087X51-60"]
[null,"X",null,null,null,null,null,"X",null,700,"X",null,null,"X","SINGLE","XB-Only","VRX1000 (700) Crossband/No Inband; For APX (VHF+800) using Single-Band Antenna(s)",3,9,3,0,981,12,2,"8J087X51-53"]
[null,"X",null,null,null,null,null,"X",null,700,null,"X",null,"X","SINGLE","XB-Only","VRX1000 (700) Crossband/No Inband; For APX (UHF+800) using Single-Band Antenna(s)",3,10,3,0,998,12,2,"8J087X51-54"]
[null,"X",null,null,null,null,null,"X",null,700,"X","X",null,"X","SINGLE","XB-Only","VRX1000 (700) Crossband/No Inband; For APX (VHF+UHF+800) using Single-Band Antenna(s)",3,11,3,0,1015,12,3,"8J087X51-60"]
[null,"X",null,null,null,null,null,"X",null,700,"X",null,"X","X","SINGLE","XB-Only","VRX1000 (700) Crossband/No Inband; For APX (VHF+700+800) using Single-Band Antenna(s)",3,13,3,0,1049,12,2,"8J087X51-53"]
[null,"X",null,null,null,null,null,"X",null,700,null,"X","X","X","SINGLE","XB-Only","VRX1000 (700) Crossband/No Inband; For APX (UHF+700+800) using Single-Band Antenna(s)",3,14,3,0,1066,12,2,"8J087X51-54"]
[null,"X",null,null,null,null,null,"X",null,700,"X","X","X","X","SINGLE","XB-Only","VRX1000 (700) Crossband/No Inband; For APX (VHF+UHF+700+800) using Single-Band Antenna(s)",3,15,3,0,1083,12,3,"8J087X51-60"]
[null,"X",null,null,null,null,null,"X",null,800,"X",null,"X",null,"SINGLE","XB-Only","VRX1000 (800) Crossband/No Inband; For APX (VHF+700) using Single-Band Antenna(s)",4,5,3,0,1186,12,2,"8J087X51-53"]
[null,"X",null,null,null,null,null,"X",null,800,null,"X","X",null,"SINGLE","XB-Only","VRX1000 (800) Crossband/No Inband; For APX (UHF+700) using Single-Band Antenna(s)",4,6,3,0,1203,12,2,"8J087X51-54"]
[null,"X",null,null,null,null,null,"X",null,800,"X","X","X",null,"SINGLE","XB-Only","VRX1000 (800) Crossband/No Inband; For APX (VHF+UHF+700) using Single-Band Antenna(s)",4,7,3,0,1220,12,3,"8J087X51-60"]
[null,"X",null,null,null,null,null,"X",null,800,"X",null,null,"X","SINGLE","XB-Only","VRX1000 (800) Crossband/No Inband; For APX (VHF+800) using Single-Band Antenna(s)",4,9,3,0,1254,12,2,"8J087X51-53"]
[null,"X",null,null,null,null,null,"X",null,800,null,"X",null,"X","SINGLE","XB-Only","VRX1000 (800) Crossband/No Inband; For APX (UHF+800) using Single-Band Antenna(s)",4,10,3,0,1271,12,2,"8J087X51-54"]
[null,"X",null,null,null,null,null,"X",null,800,"X","X",null,"X","SINGLE","XB-Only","VRX1000 (800) Crossband/No Inband; For APX (VHF+UHF+800) using Single-Band Antenna(s)",4,11,3,0,1288,12,3,"8J087X51-60"]
[null,"X",null,null,null,null,null,"X",null,800,"X",null,"X","X","SINGLE","XB-Only","VRX1000 (800) Crossband/No Inband; For APX (VHF+700+800) using Single-Band Antenna(s)",4,13,3,0,1322,12,2,"8J087X51-53"]
[null,"X",null,null,null,null,null,"X",null,800,null,"X","X","X","SINGLE","XB-Only","VRX1000 (800) Crossband/No Inband; For APX (UHF+700+800) using Single-Band Antenna(s)",4,14,3,0,1339,12,2,"8J087X51-54"]
[null,"X",null,null,null,null,null,"X",null,800,"X","X","X","X","SINGLE","XB-Only","VRX1000 (800) Crossband/No Inband; For APX (VHF+UHF+700+800) using Single-Band Antenna(s)",4,15,3,0,1356,12,3,"8J087X51-60"]
["X",null,null,null,null,"X","X",null,null,"VHF","X",null,null,null,"SINGLE","IB-Forced","VRX1000 (VHF) Inband; For APX (VHF) using Single-Band Antenna(s)",1,1,2,0,296,13,1,"No Drawing"]
["X",null,null,null,null,"X","X",null,null,"VHF","X",null,null,null,"ALL","IB-Forced","VRX1000 (VHF) Inband; For APX (VHF) using One All-Band Antenna",1,1,2,1,297,13,1,"No Drawing"]
["X",null,null,null,null,"X","X",null,null,"VHF","X",null,null,null,"USER","IB-Forced","VRX1000 (VHF) Inband; For APX (VHF) using Unknown or User-Defined Antenna",1,1,2,2,298,13,1,"No Drawing"]
["X",null,null,null,null,"X","X",null,null,"UHF",null,"X",null,null,"SINGLE","IB-Forced","VRX1000 (UHF) Inband; For APX (UHF) using Single-Band Antenna(s)",2,2,2,0,586,13,1,"No Drawing"]
["X",null,null,null,null,"X","X",null,null,"UHF",null,"X",null,null,"ALL","IB-Forced","VRX1000 (UHF) Inband; For APX (UHF) using One All-Band Antenna",2,2,2,1,587,13,1,"No Drawing"]
["X",null,null,null,null,"X","X",null,null,"UHF",null,"X",null,null,"USER","IB-Forced","VRX1000 (UHF) Inband; For APX (UHF) using Unknown or User-Defined Antenna",2,2,2,2,588,13,1,"No Drawing"]
["X",null,null,null,null,"X","X",null,null,700,null,null,"X",null,"SINGLE","IB-Forced","VRX1000 (700) Inband; For APX (700) using Single-Band Antenna(s)",3,4,2,0,893,13,1,"No Drawing"]
["X",null,null,null,null,"X","X",null,null,700,null,null,"X",null,"ALL","IB-Forced","VRX1000 (700) Inband; For APX (700) using One All-Band Antenna",3,4,2,1,894,13,1,"No Drawing"]
["X",null,null,null,null,"X","X",null,null,700,null,null,"X",null,"USER","IB-Forced","VRX1000 (700) Inband; For APX (700) using Unknown or User-Defined Antenna",3,4,2,2,895,13,1,"No Drawing"]
["X",null,null,null,null,"X","X",null,null,700,null,null,null,"X","SINGLE","IB-Forced","VRX1000 (700) Inband; For APX (800) using Single-Band Antenna(s)",3,8,2,0,961,13,1,"No Drawing"]
["X",null,null,null,null,"X","X",null,null,700,null,null,null,"X","ALL","IB-Forced","VRX1000 (700) Inband; For APX (800) using One All-Band Antenna",3,8,2,1,962,13,1,"No Drawing"]
["X",null,null,null,null,"X","X",null,null,700,null,null,null,"X","USER","IB-Forced","VRX1000 (700) Inband; For APX (800) using Unknown or User-Defined Antenna",3,8,2,2,963,13,1,"No Drawing"]
["X",null,null,null,null,"X","X",null,null,700,null,null,"X","X","SINGLE","IB-Forced","VRX1000 (700) Inband; For APX (700+800) using Single-Band Antenna(s)",3,12,2,0,1029,13,1,"No Drawing"]
["X",null,null,null,null,"X","X",null,null,700,null,null,"X","X","ALL","IB-Forced","VRX1000 (700) Inband; For APX (700+800) using One All-Band Antenna",3,12,2,1,1030,13,1,"No Drawing"]
["X",null,null,null,null,"X","X",null,null,700,null,null,"X","X","USER","IB-Forced","VRX1000 (700) Inband; For APX (700+800) using Unknown or User-Defined Antenna",3,12,2,2,1031,13,1,"No Drawing"]
["X",null,null,null,null,"X","X",null,null,800,null,null,"X",null,"SINGLE","IB-Forced","VRX1000 (800) Inband; For APX (700) using Single-Band Antenna(s)",4,4,2,0,1166,13,1,"No Drawing"]
["X",null,null,null,null,"X","X",null,null,800,null,null,"X",null,"ALL","IB-Forced","VRX1000 (800) Inband; For APX (700) using One All-Band Antenna",4,4,2,1,1167,13,1,"No Drawing"]
["X",null,null,null,null,"X","X",null,null,800,null,null,"X",null,"USER","IB-Forced","VRX1000 (800) Inband; For APX (700) using Unknown or User-Defined Antenna",4,4,2,2,1168,13,1,"No Drawing"]
["X",null,null,null,null,"X","X",null,null,800,null,null,null,"X","SINGLE","IB-Forced","VRX1000 (800) Inband; For APX (800) using Single-Band Antenna(s)",4,8,2,0,1234,13,1,"No Drawing"]
["X",null,null,null,null,"X","X",null,null,800,null,null,null,"X","ALL","IB-Forced","VRX1000 (800) Inband; For APX (800) using One All-Band Antenna",4,8,2,1,1235,13,1,"No Drawing"]
["X",null,null,null,null,"X","X",null,null,800,null,null,null,"X","USER","IB-Forced","VRX1000 (800) Inband; For APX (800) using Unknown or User-Defined Antenna",4,8,2,2,1236,13,1,"No Drawing"]
["X",null,null,null,null,"X","X",null,null,800,null,null,"X","X","SINGLE","IB-Forced","VRX1000 (800) Inband; For APX (700+800) using Single-Band Antenna(s)",4,12,2,0,1302,13,1,"No Drawing"]
["X",null,null,null,null,"X","X",null,null,800,null,null,"X","X","ALL","IB-Forced","VRX1000 (800) Inband; For APX (700+800) using One All-Band Antenna",4,12,2,1,1303,13,1,"No Drawing"]
["X",null,null,null,null,"X","X",null,null,800,null,null,"X","X","USER","IB-Forced","VRX1000 (800) Inband; For APX (700+800) using Unknown or User-Defined Antenna",4,12,2,2,1304,13,1,"No Drawing"]
["X",null,null,null,null,"X","X",null,null,"VHF","X","X",null,null,"ALL","IB-Only","VRX1000 (VHF) Inband/No Crossband; For APX (VHF+UHF) using One All-Band Antenna",1,3,1,1,328,13,2,"No Drawing"]
["X",null,null,null,null,"X","X",null,null,"VHF","X","X",null,null,"USER","IB-Only","VRX1000 (VHF) Inband/No Crossband; For APX (VHF+UHF) using Unknown or User-Defined Antenna",1,3,1,2,329,13,2,"No Drawing"]
["X",null,null,null,null,"X","X",null,null,"VHF","X",null,"X",null,"ALL","IB-Only","VRX1000 (VHF) Inband/No Crossband; For APX (VHF+700) using One All-Band Antenna",1,5,1,1,362,13,2,"No Drawing"]
["X",null,null,null,null,"X","X",null,null,"VHF","X",null,"X",null,"USER","IB-Only","VRX1000 (VHF) Inband/No Crossband; For APX (VHF+700) using Unknown or User-Defined Antenna",1,5,1,2,363,13,2,"No Drawing"]
["X",null,null,null,null,"X","X",null,null,"VHF","X",null,null,"X","ALL","IB-Only","VRX1000 (VHF) Inband/No Crossband; For APX (VHF+800) using One All-Band Antenna",1,9,1,1,430,13,2,"No Drawing"]
["X",null,null,null,null,"X","X",null,null,"VHF","X",null,null,"X","USER","IB-Only","VRX1000 (VHF) Inband/No Crossband; For APX (VHF+800) using Unknown or User-Defined Antenna",1,9,1,2,431,13,2,"No Drawing"]
["X",null,null,null,null,"X","X",null,null,"VHF","X",null,"X","X","ALL","IB-Only","VRX1000 (VHF) Inband/No Crossband; For APX (VHF+700+800) using One All-Band Antenna",1,13,1,1,498,13,2,"No Drawing"]
["X",null,null,null,null,"X","X",null,null,"VHF","X",null,"X","X","USER","IB-Only","VRX1000 (VHF) Inband/No Crossband; For APX (VHF+700+800) using Unknown or User-Defined Antenna",1,13,1,2,499,13,2,"No Drawing"]
["X",null,null,null,null,"X","X",null,null,"UHF","X","X",null,null,"ALL","IB-Only","VRX1000 (UHF) Inband/No Crossband; For APX (VHF+UHF) using One All-Band Antenna",2,3,1,1,601,13,2,"No Drawing"]
["X",null,null,null,null,"X","X",null,null,"UHF","X","X",null,null,"USER","IB-Only","VRX1000 (UHF) Inband/No Crossband; For APX (VHF+UHF) using Unknown or User-Defined Antenna",2,3,1,2,602,13,2,"No Drawing"]
["X",null,null,null,null,"X","X",null,null,"UHF",null,"X","X",null,"ALL","IB-Only","VRX1000 (UHF) Inband/No Crossband; For APX (UHF+700) using One All-Band Antenna",2,6,1,1,652,13,2,"No Drawing"]
["X",null,null,null,null,"X","X",null,null,"UHF",null,"X","X",null,"USER","IB-Only","VRX1000 (UHF) Inband/No Crossband; For APX (UHF+700) using Unknown or User-Defined Antenna",2,6,1,2,653,13,2,"No Drawing"]
["X",null,null,null,null,"X","X",null,null,"UHF",null,"X",null,"X","ALL","IB-Only",{"$f":"$J$6&\"(\"&$J199&\")\"&\" \"&VLOOKUP($P199,RPTCodes,2,FALSE) &\"; For APX (\"&VLOOKUP($S199,BAND_NAMES,2)&\") using \"&VLOOKUP($O199,ANTcodes,3,FALSE)","v":"VRX1000 (UHF) Inband/No Crossband; For APX (UHF+800) using One All-Band Antenna"},{"$f":"VLOOKUP(J199,Freq_Bands,2)","v":2},{"$f":"IF(K199=\"X\",1,0)+IF(L199=\"X\",2,0)+IF(M199=\"X\",4,0)+IF(N199=\"X\",8,0)","v":10},{"$f":"VLOOKUP(P199,RPTCodes,4,FALSE)","v":1},{"$f":"VLOOKUP(O199,ANTcodes,2,FALSE)","v":1},{"$f":"$U199*MULT_ANT+$T199*MULT_RPT+$S199*MULT_MRF+$R199*MULT_VRF","v":720},{"$f":"IF($A199=\"X\",1,0)+IF($B199=\"X\",2,0)+IF($C199=\"X\",3,0)+IF($D199=\"X\",4,0)+IF($E199=\"X\",5,0)+IF($F199=\"X\",6,0)+IF($H199=\"X\",10,0)+IF($G199=\"X\",6,0)","v":13},{"$f":"COUNTA(K199:L199)+IF(RIGHT(M199&N199,1)=\"X\",1,0)","v":2},"No Drawing"]
["X",null,null,null,null,"X","X",null,null,"UHF",null,"X",null,"X","USER","IB-Only","VRX1000 (UHF) Inband/No Crossband; For APX (UHF+800) using Unknown or User-Defined Antenna",2,10,1,2,721,13,2,"No Drawing"]
["X",null,null,null,null,"X","X",null,null,"UHF",null,"X","X","X","ALL","IB-Only","VRX1000 (UHF) Inband/No Crossband; For APX (UHF+700+800) using One All-Band Antenna",2,14,1,1,788,13,2,"No Drawing"]
["X",null,null,null,null,"X","X",null,null,"UHF",null,"X","X","X","USER","IB-Only","VRX1000 (UHF) Inband/No Crossband; For APX (UHF+700+800) using Unknown or User-Defined Antenna",2,14,1,2,789,13,2,"No Drawing"]
["X",null,null,null,null,"X","X",null,null,700,"X",null,"X",null,"ALL","IB-Only","VRX1000 (700) Inband/No Crossband; For APX (VHF+700) using One All-Band Antenna",3,5,1,1,908,13,2,"No Drawing"]
["X",null,null,null,null,"X","X",null,null,700,"X",null,"X",null,"USER","IB-Only","VRX1000 (700) Inband/No Crossband; For APX (VHF+700) using Unknown or User-Defined Antenna",3,5,1,2,909,13,2,"No Drawing"]
["X",null,null,null,null,"X","X",null,null,700,null,"X","X",null,"ALL","IB-Only","VRX1000 (700) Inband/No Crossband; For APX (UHF+700) using One All-Band Antenna",3,6,1,1,925,13,2,"No Drawing"]
["X",null,null,null,null,"X","X",null,null,700,null,"X","X",null,"USER","IB-Only","VRX1000 (700) Inband/No Crossband; For APX (UHF+700) using Unknown or User-Defined Antenna",3,6,1,2,926,13,2,"No Drawing"]
["X",null,null,null,null,"X","X",null,null,700,"X",null,null,"X","ALL","IB-Only","VRX1000 (700) Inband/No Crossband; For APX (VHF+800) using One All-Band Antenna",3,9,1,1,976,13,2,"No Drawing"]
["X",null,null,null,null,"X","X",null,null,700,"X",null,null,"X","USER","IB-Only","VRX1000 (700) Inband/No Crossband; For APX (VHF+800) using Unknown or User-Defined Antenna",3,9,1,2,977,13,2,"No Drawing"]
["X",null,null,null,null,"X","X",null,null,700,null,"X",null,"X","ALL","IB-Only","VRX1000 (700) Inband/No Crossband; For APX (UHF+800) using One All-Band Antenna",3,10,1,1,993,13,2,"No Drawing"]
["X",null,null,null,null,"X","X",null,null,700,null,"X",null,"X","USER","IB-Only","VRX1000 (700) Inband/No Crossband; For APX (UHF+800) using Unknown or User-Defined Antenna",3,10,1,2,994,13,2,"No Drawing"]
["X",null,null,null,null,"X","X",null,null,700,"X",null,"X","X","ALL","IB-Only","VRX1000 (700) Inband/No Crossband; For APX (VHF+700+800) using One All-Band Antenna",3,13,1,1,1044,13,2,"No Drawing"]
["X",null,null,null,null,"X","X",null,null,700,"X",null,"X","X","USER","IB-Only","VRX1000 (700) Inband/No Crossband; For APX (VHF+700+800) using Unknown or User-Defined Antenna",3,13,1,2,1045,13,2,"No Drawing"]
["X",null,null,null,null,"X","X",null,null,700,null,"X","X","X","ALL","IB-Only","VRX1000 (700) Inband/No Crossband; For APX (UHF+700+800) using One All-Band Antenna",3,14,1,1,1061,13,2,"No Drawing"]
["X",null,null,null,null,"X","X",null,null,700,null,"X","X","X","USER","IB-Only","VRX1000 (700) Inband/No Crossband; For APX (UHF+700+800) using Unknown or User-Defined Antenna",3,14,1,2,1062,13,2,"No Drawing"]
["X",null,null,null,null,"X","X",null,null,800,"X",null,"X",null,"ALL","IB-Only","VRX1000 (800) Inband/No Crossband; For APX (VHF+700) using One All-Band Antenna",4,5,1,1,1181,13,2,"No Drawing"]
["X",null,null,null,null,"X","X",null,null,800,"X",null,"X",null,"USER","IB-Only","VRX1000 (800) Inband/No Crossband; For APX (VHF+700) using Unknown or User-Defined Antenna",4,5,1,2,1182,13,2,"No Drawing"]
["X",null,null,null,null,"X","X",null,null,800,null,"X","X",null,"ALL","IB-Only","VRX1000 (800) Inband/No Crossband; For APX (UHF+700) using One All-Band Antenna",4,6,1,1,1198,13,2,"No Drawing"]
["X",null,null,null,null,"X","X",null,null,800,null,"X","X",null,"USER","IB-Only","VRX1000 (800) Inband/No Crossband; For APX (UHF+700) using Unknown or User-Defined Antenna",4,6,1,2,1199,13,2,"No Drawing"]
["X",null,null,null,null,"X","X",null,null,800,"X",null,null,"X","ALL","IB-Only","VRX1000 (800) Inband/No Crossband; For APX (VHF+800) using One All-Band Antenna",4,9,1,1,1249,13,2,"No Drawing"]
["X",null,null,null,null,"X","X",null,null,800,"X",null,null,"X","USER","IB-Only","VRX1000 (800) Inband/No Crossband; For APX (VHF+800) using Unknown or User-Defined Antenna",4,9,1,2,1250,13,2,"No Drawing"]
["X",null,null,null,null,"X","X",null,null,800,null,"X",null,"X","ALL","IB-Only","VRX1000 (800) Inband/No Crossband; For APX (UHF+800) using One All-Band Antenna",4,10,1,1,1266,13,2,"No Drawing"]
["X",null,null,null,null,"X","X",null,null,800,null,"X",null,"X","USER","IB-Only","VRX1000 (800) Inband/No Crossband; For APX (UHF+800) using Unknown or User-Defined Antenna",4,10,1,2,1267,13,2,"No Drawing"]
["X",null,null,null,null,"X","X",null,null,800,"X",null,"X","X","ALL","IB-Only","VRX1000 (800) Inband/No Crossband; For APX (VHF+700+800) using One All-Band Antenna",4,13,1,1,1317,13,2,"No Drawing"]
["X",null,null,null,null,"X","X",null,null,800,"X",null,"X","X","USER","IB-Only","VRX1000 (800) Inband/No Crossband; For APX (VHF+700+800) using Unknown or User-Defined Antenna",4,13,1,2,1318,13,2,"No Drawing"]
["X",null,null,null,null,"X","X",null,null,800,null,"X","X","X","ALL","IB-Only","VRX1000 (800) Inband/No Crossband; For APX (UHF+700+800) using One All-Band Antenna",4,14,1,1,1334,13,2,"No Drawing"]
["X",null,null,null,null,"X","X",null,null,800,null,"X","X","X","USER","IB-Only","VRX1000 (800) Inband/No Crossband; For APX (UHF+700+800) using Unknown or User-Defined Antenna",4,14,1,2,1335,13,2,"No Drawing"]
["X",null,null,null,null,"X","X",null,null,"VHF","X","X","X",null,"ALL","IB-Only","VRX1000 (VHF) Inband/No Crossband; For APX (VHF+UHF+700) using One All-Band Antenna",1,7,1,1,396,13,3,"No Drawing"]
["X",null,null,null,null,"X","X",null,null,"VHF","X","X","X",null,"USER","IB-Only","VRX1000 (VHF) Inband/No Crossband; For APX (VHF+UHF+700) using Unknown or User-Defined Antenna",1,7,1,2,397,13,3,"No Drawing"]
["X",null,null,null,null,"X","X",null,null,"VHF","X","X",null,"X","ALL","IB-Only","VRX1000 (VHF) Inband/No Crossband; For APX (VHF+UHF+800) using One All-Band Antenna",1,11,1,1,464,13,3,"No Drawing"]
["X",null,null,null,null,"X","X",null,null,"VHF","X","X",null,"X","USER","IB-Only","VRX1000 (VHF) Inband/No Crossband; For APX (VHF+UHF+800) using Unknown or User-Defined Antenna",1,11,1,2,465,13,3,"No Drawing"]
["X",null,null,null,null,"X","X",null,null,"VHF","X","X","X","X","ALL","IB-Only","VRX1000 (VHF) Inband/No Crossband; For APX (VHF+UHF+700+800) using One All-Band Antenna",1,15,1,1,532,13,3,"No Drawing"]
["X",null,null,null,null,"X","X",null,null,"VHF","X","X","X","X","USER","IB-Only","VRX1000 (VHF) Inband/No Crossband; For APX (VHF+UHF+700+800) using Unknown or User-Defined Antenna",1,15,1,2,533,13,3,"No Drawing"]
["X",null,null,null,null,"X","X",null,null,"UHF","X","X","X",null,"ALL","IB-Only","VRX1000 (UHF) Inband/No Crossband; For APX (VHF+UHF+700) using One All-Band Antenna",2,7,1,1,669,13,3,"No Drawing"]
["X",null,null,null,null,"X","X",null,null,"UHF","X","X","X",null,"USER","IB-Only","VRX1000 (UHF) Inband/No Crossband; For APX (VHF+UHF+700) using Unknown or User-Defined Antenna",2,7,1,2,670,13,3,"No Drawing"]
["X",null,null,null,null,"X","X",null,null,"UHF","X","X",null,"X","ALL","IB-Only","VRX1000 (UHF) Inband/No Crossband; For APX (VHF+UHF+800) using One All-Band Antenna",2,11,1,1,737,13,3,"No Drawing"]
["X",null,null,null,null,"X","X",null,null,"UHF","X","X",null,"X","USER","IB-Only","VRX1000 (UHF) Inband/No Crossband; For APX (VHF+UHF+800) using Unknown or User-Defined Antenna",2,11,1,2,738,13,3,"No Drawing"]
["X",null,null,null,null,"X","X",null,null,"UHF","X","X","X","X","ALL","IB-Only","VRX1000 (UHF) Inband/No Crossband; For APX (VHF+UHF+700+800) using One All-Band Antenna",2,15,1,1,805,13,3,"No Drawing"]
["X",null,null,null,null,"X","X",null,null,"UHF","X","X","X","X","USER","IB-Only","VRX1000 (UHF) Inband/No Crossband; For APX (VHF+UHF+700+800) using Unknown or User-Defined Antenna",2,15,1,2,806,13,3,"No Drawing"]
["X",null,null,null,null,"X","X",null,null,700,"X","X","X",null,"ALL","IB-Only","VRX1000 (700) Inband/No Crossband; For APX (VHF+UHF+700) using One All-Band Antenna",3,7,1,1,942,13,3,"No Drawing"]
["X",null,null,null,null,"X","X",null,null,700,"X","X","X",null,"USER","IB-Only","VRX1000 (700) Inband/No Crossband; For APX (VHF+UHF+700) using Unknown or User-Defined Antenna",3,7,1,2,943,13,3,"No Drawing"]
["X",null,null,null,null,"X","X",null,null,700,"X","X",null,"X","ALL","IB-Only","VRX1000 (700) Inband/No Crossband; For APX (VHF+UHF+800) using One All-Band Antenna",3,11,1,1,1010,13,3,"No Drawing"]
["X",null,null,null,null,"X","X",null,null,700,"X","X",null,"X","USER","IB-Only","VRX1000 (700) Inband/No Crossband; For APX (VHF+UHF+800) using Unknown or User-Defined Antenna",3,11,1,2,1011,13,3,"No Drawing"]
["X",null,null,null,null,"X","X",null,null,700,"X","X","X","X","ALL","IB-Only","VRX1000 (700) Inband/No Crossband; For APX (VHF+UHF+700+800) using One All-Band Antenna",3,15,1,1,1078,13,3,"No Drawing"]
["X",null,null,null,null,"X","X",null,null,700,"X","X","X","X","USER","IB-Only","VRX1000 (700) Inband/No Crossband; For APX (VHF+UHF+700+800) using Unknown or User-Defined Antenna",3,15,1,2,1079,13,3,"No Drawing"]
["X",null,null,null,null,"X","X",null,null,800,"X","X","X",null,"ALL","IB-Only","VRX1000 (800) Inband/No Crossband; For APX (VHF+UHF+700) using One All-Band Antenna",4,7,1,1,1215,13,3,"No Drawing"]
["X",null,null,null,null,"X","X",null,null,800,"X","X","X",null,"USER","IB-Only","VRX1000 (800) Inband/No Crossband; For APX (VHF+UHF+700) using Unknown or User-Defined Antenna",4,7,1,2,1216,13,3,"No Drawing"]
["X",null,null,null,null,"X","X",null,null,800,"X","X",null,"X","ALL","IB-Only","VRX1000 (800) Inband/No Crossband; For APX (VHF+UHF+800) using One All-Band Antenna",4,11,1,1,1283,13,3,"No Drawing"]
["X",null,null,null,null,"X","X",null,null,800,"X","X",null,"X","USER","IB-Only","VRX1000 (800) Inband/No Crossband; For APX (VHF+UHF+800) using Unknown or User-Defined Antenna",4,11,1,2,1284,13,3,"No Drawing"]
["X",null,null,null,null,"X","X",null,null,800,"X","X","X","X","ALL","IB-Only","VRX1000 (800) Inband/No Crossband; For APX (VHF+UHF+700+800) using One All-Band Antenna",4,15,1,1,1351,13,3,"No Drawing"]
["X",null,null,null,null,"X","X",null,null,800,"X","X","X","X","USER","IB-Only","VRX1000 (800) Inband/No Crossband; For APX (VHF+UHF+700+800) using Unknown or User-Defined Antenna",4,15,1,2,1352,13,3,"No Drawing"]
[null,"X",null,null,null,"X","X",null,null,"VHF","X","X",null,null,"SINGLE","IB+XB","VRX1000 (VHF) Inband & Crossband; For APX (VHF+UHF) using Single-Band Antenna(s)",1,3,5,0,339,14,2,"No Drawing"]
[null,"X",null,null,null,"X","X",null,null,"VHF","X",null,"X",null,"SINGLE","IB+XB","VRX1000 (VHF) Inband & Crossband; For APX (VHF+700) using Single-Band Antenna(s)",1,5,5,0,373,14,2,"No Drawing"]
[null,"X",null,null,null,"X","X",null,null,"VHF","X",null,null,"X","SINGLE","IB+XB","VRX1000 (VHF) Inband & Crossband; For APX (VHF+800) using Single-Band Antenna(s)",1,9,5,0,441,14,2,"No Drawing"]
[null,"X",null,null,null,"X","X",null,null,"VHF","X",null,"X","X","SINGLE","IB+XB","VRX1000 (VHF) Inband & Crossband; For APX (VHF+700+800) using Single-Band Antenna(s)",1,13,5,0,509,14,2,"No Drawing"]
[null,"X",null,null,null,"X","X",null,null,"UHF","X","X",null,null,"SINGLE","IB+XB","VRX1000 (UHF) Inband & Crossband; For APX (VHF+UHF) using Single-Band Antenna(s)",2,3,5,0,612,14,2,"No Drawing"]
[null,"X",null,null,null,"X","X",null,null,"UHF",null,"X","X",null,"SINGLE","IB+XB","VRX1000 (UHF) Inband & Crossband; For APX (UHF+700) using Single-Band Antenna(s)",2,6,5,0,663,14,2,"No Drawing"]
[null,"X",null,null,null,"X","X",null,null,"UHF",null,"X",null,"X","SINGLE","IB+XB","VRX1000 (UHF) Inband & Crossband; For APX (UHF+800) using Single-Band Antenna(s)",2,10,5,0,731,14,2,"No Drawing"]
[null,"X",null,null,null,"X","X",null,null,"UHF",null,"X","X","X","SINGLE","IB+XB","VRX1000 (UHF) Inband & Crossband; For APX (UHF+700+800) using Single-Band Antenna(s)",2,14,5,0,799,14,2,"No Drawing"]
[null,"X",null,null,null,"X","X",null,null,700,"X",null,"X",null,"SINGLE","IB+XB","VRX1000 (700) Inband & Crossband; For APX (VHF+700) using Single-Band Antenna(s)",3,5,5,0,919,14,2,"No Drawing"]
[null,"X",null,null,null,"X","X",null,null,700,null,"X","X",null,"SINGLE","IB+XB","VRX1000 (700) Inband & Crossband; For APX (UHF+700) using Single-Band Antenna(s)",3,6,5,0,936,14,2,"No Drawing"]
[null,"X",null,null,null,"X","X",null,null,700,"X",null,null,"X","SINGLE","IB+XB","VRX1000 (700) Inband & Crossband; For APX (VHF+800) using Single-Band Antenna(s)",3,9,5,0,987,14,2,"No Drawing"]
[null,"X",null,null,null,"X","X",null,null,700,null,"X",null,"X","SINGLE","IB+XB","VRX1000 (700) Inband & Crossband; For APX (UHF+800) using Single-Band Antenna(s)",3,10,5,0,1004,14,2,"No Drawing"]
[null,"X",null,null,null,"X","X",null,null,700,"X",null,"X","X","SINGLE","IB+XB",{"$f":"$J$6&\"(\"&$J263&\")\"&\" \"&VLOOKUP($P263,RPTCodes,2,FALSE) &\"; For APX (\"&VLOOKUP($S263,BAND_NAMES,2)&\") using \"&VLOOKUP($O263,ANTcodes,3,FALSE)","v":"VRX1000 (700) Inband & Crossband; For APX (VHF+700+800) using Single-Band Antenna(s)"},{"$f":"VLOOKUP(J263,Freq_Bands,2)","v":3},{"$f":"IF(K263=\"X\",1,0)+IF(L263=\"X\",2,0)+IF(M263=\"X\",4,0)+IF(N263=\"X\",8,0)","v":13},{"$f":"VLOOKUP(P263,RPTCodes,4,FALSE)","v":5},{"$f":"VLOOKUP(O263,ANTcodes,2,FALSE)","v":0},{"$f":"$U263*MULT_ANT+$T263*MULT_RPT+$S263*MULT_MRF+$R263*MULT_VRF","v":1055},{"$f":"IF($A263=\"X\",1,0)+IF($B263=\"X\",2,0)+IF($C263=\"X\",3,0)+IF($D263=\"X\",4,0)+IF($E263=\"X\",5,0)+IF($F263=\"X\",6,0)+IF($H263=\"X\",10,0)+IF($G263=\"X\",6,0)","v":14},{"$f":"COUNTA(K263:L263)+IF(RIGHT(M263&N263,1)=\"X\",1,0)","v":2},"No Drawing"]
[null,"X",null,null,null,"X","X",null,null,700,null,"X","X","X","SINGLE","IB+XB","VRX1000 (700) Inband & Crossband; For APX (UHF+700+800) using Single-Band Antenna(s)",3,14,5,0,1072,14,2,"No Drawing"]
[null,"X",null,null,null,"X","X",null,null,800,"X",null,"X",null,"SINGLE","IB+XB","VRX1000 (800) Inband & Crossband; For APX (VHF+700) using Single-Band Antenna(s)",4,5,5,0,1192,14,2,"No Drawing"]
[null,"X",null,null,null,"X","X",null,null,800,null,"X","X",null,"SINGLE","IB+XB","VRX1000 (800) Inband & Crossband; For APX (UHF+700) using Single-Band Antenna(s)",4,6,5,0,1209,14,2,"No Drawing"]
[null,"X",null,null,null,"X","X",null,null,800,"X",null,null,"X","SINGLE","IB+XB","VRX1000 (800) Inband & Crossband; For APX (VHF+800) using Single-Band Antenna(s)",4,9,5,0,1260,14,2,"No Drawing"]
[null,"X",null,null,null,"X","X",null,null,800,null,"X",null,"X","SINGLE","IB+XB","VRX1000 (800) Inband & Crossband; For APX (UHF+800) using Single-Band Antenna(s)",4,10,5,0,1277,14,2,"No Drawing"]
[null,"X",null,null,null,"X","X",null,null,800,"X",null,"X","X","SINGLE","IB+XB","VRX1000 (800) Inband & Crossband; For APX (VHF+700+800) using Single-Band Antenna(s)",4,13,5,0,1328,14,2,"No Drawing"]
[null,"X",null,null,null,"X","X",null,null,800,null,"X","X","X","SINGLE","IB+XB","VRX1000 (800) Inband & Crossband; For APX (UHF+700+800) using Single-Band Antenna(s)",4,14,5,0,1345,14,2,"No Drawing"]
[null,"X",null,null,null,"X","X",null,null,"VHF","X","X",null,null,"SINGLE","IB-Only","VRX1000 (VHF) Inband/No Crossband; For APX (VHF+UHF) using Single-Band Antenna(s)",1,3,1,0,327,14,2,"No Drawing"]
[null,"X",null,null,null,"X","X",null,null,"VHF","X",null,"X",null,"SINGLE","IB-Only","VRX1000 (VHF) Inband/No Crossband; For APX (VHF+700) using Single-Band Antenna(s)",1,5,1,0,361,14,2,"No Drawing"]
[null,"X",null,null,null,"X","X",null,null,"VHF","X",null,null,"X","SINGLE","IB-Only","VRX1000 (VHF) Inband/No Crossband; For APX (VHF+800) using Single-Band Antenna(s)",1,9,1,0,429,14,2,"No Drawing"]
[null,"X",null,null,null,"X","X",null,null,"VHF","X",null,"X","X","SINGLE","IB-Only","VRX1000 (VHF) Inband/No Crossband; For APX (VHF+700+800) using Single-Band Antenna(s)",1,13,1,0,497,14,2,"No Drawing"]
[null,"X",null,null,null,"X","X",null,null,"UHF","X","X",null,null,"SINGLE","IB-Only","VRX1000 (UHF) Inband/No Crossband; For APX (VHF+UHF) using Single-Band Antenna(s)",2,3,1,0,600,14,2,"No Drawing"]
[null,"X",null,null,null,"X","X",null,null,"UHF",null,"X","X",null,"SINGLE","IB-Only","VRX1000 (UHF) Inband/No Crossband; For APX (UHF+700) using Single-Band Antenna(s)",2,6,1,0,651,14,2,"No Drawing"]
[null,"X",null,null,null,"X","X",null,null,"UHF",null,"X",null,"X","SINGLE","IB-Only","VRX1000 (UHF) Inband/No Crossband; For APX (UHF+800) using Single-Band Antenna(s)",2,10,1,0,719,14,2,"No Drawing"]
[null,"X",null,null,null,"X","X",null,null,"UHF",null,"X","X","X","SINGLE","IB-Only","VRX1000 (UHF) Inband/No Crossband; For APX (UHF+700+800) using Single-Band Antenna(s)",2,14,1,0,787,14,2,"No Drawing"]
[null,"X",null,null,null,"X","X",null,null,700,"X",null,"X",null,"SINGLE","IB-Only","VRX1000 (700) Inband/No Crossband; For APX (VHF+700) using Single-Band Antenna(s)",3,5,1,0,907,14,2,"No Drawing"]
[null,"X",null,null,null,"X","X",null,null,700,null,"X","X",null,"SINGLE","IB-Only","VRX1000 (700) Inband/No Crossband; For APX (UHF+700) using Single-Band Antenna(s)",3,6,1,0,924,14,2,"No Drawing"]
[null,"X",null,null,null,"X","X",null,null,700,"X",null,null,"X","SINGLE","IB-Only","VRX1000 (700) Inband/No Crossband; For APX (VHF+800) using Single-Band Antenna(s)",3,9,1,0,975,14,2,"No Drawing"]
[null,"X",null,null,null,"X","X",null,null,700,null,"X",null,"X","SINGLE","IB-Only","VRX1000 (700) Inband/No Crossband; For APX (UHF+800) using Single-Band Antenna(s)",3,10,1,0,992,14,2,"No Drawing"]
[null,"X",null,null,null,"X","X",null,null,700,"X",null,"X","X","SINGLE","IB-Only","VRX1000 (700) Inband/No Crossband; For APX (VHF+700+800) using Single-Band Antenna(s)",3,13,1,0,1043,14,2,"No Drawing"]
[null,"X",null,null,null,"X","X",null,null,700,null,"X","X","X","SINGLE","IB-Only","VRX1000 (700) Inband/No Crossband; For APX (UHF+700+800) using Single-Band Antenna(s)",3,14,1,0,1060,14,2,"No Drawing"]
[null,"X",null,null,null,"X","X",null,null,800,"X",null,"X",null,"SINGLE","IB-Only","VRX1000 (800) Inband/No Crossband; For APX (VHF+700) using Single-Band Antenna(s)",4,5,1,0,1180,14,2,"No Drawing"]
[null,"X",null,null,null,"X","X",null,null,800,null,"X","X",null,"SINGLE","IB-Only","VRX1000 (800) Inband/No Crossband; For APX (UHF+700) using Single-Band Antenna(s)",4,6,1,0,1197,14,2,"No Drawing"]
[null,"X",null,null,null,"X","X",null,null,800,"X",null,null,"X","SINGLE","IB-Only","VRX1000 (800) Inband/No Crossband; For APX (VHF+800) using Single-Band Antenna(s)",4,9,1,0,1248,14,2,"No Drawing"]
[null,"X",null,null,null,"X","X",null,null,800,null,"X",null,"X","SINGLE","IB-Only","VRX1000 (800) Inband/No Crossband; For APX (UHF+800) using Single-Band Antenna(s)",4,10,1,0,1265,14,2,"No Drawing"]
[null,"X",null,null,null,"X","X",null,null,800,"X",null,"X","X","SINGLE","IB-Only","VRX1000 (800) Inband/No Crossband; For APX (VHF+700+800) using Single-Band Antenna(s)",4,13,1,0,1316,14,2,"No Drawing"]
[null,"X",null,null,null,"X","X",null,null,800,null,"X","X","X","SINGLE","IB-Only","VRX1000 (800) Inband/No Crossband; For APX (UHF+700+800) using Single-Band Antenna(s)",4,14,1,0,1333,14,2,"No Drawing"]
[null,"X",null,null,null,"X","X",null,null,"VHF","X","X","X",null,"SINGLE","IB+XB","VRX1000 (VHF) Inband & Crossband; For APX (VHF+UHF+700) using Single-Band Antenna(s)",1,7,5,0,407,14,3,"No Drawing"]
[null,"X",null,null,null,"X","X",null,null,"VHF","X","X",null,"X","SINGLE","IB+XB","VRX1000 (VHF) Inband & Crossband; For APX (VHF+UHF+800) using Single-Band Antenna(s)",1,11,5,0,475,14,3,"No Drawing"]
[null,"X",null,null,null,"X","X",null,null,"VHF","X","X","X","X","SINGLE","IB+XB","VRX1000 (VHF) Inband & Crossband; For APX (VHF+UHF+700+800) using Single-Band Antenna(s)",1,15,5,0,543,14,3,"No Drawing"]
[null,"X",null,null,null,"X","X",null,null,"UHF","X","X","X",null,"SINGLE","IB+XB","VRX1000 (UHF) Inband & Crossband; For APX (VHF+UHF+700) using Single-Band Antenna(s)",2,7,5,0,680,14,3,"No Drawing"]
[null,"X",null,null,null,"X","X",null,null,"UHF","X","X",null,"X","SINGLE","IB+XB","VRX1000 (UHF) Inband & Crossband; For APX (VHF+UHF+800) using Single-Band Antenna(s)",2,11,5,0,748,14,3,"No Drawing"]
[null,"X",null,null,null,"X","X",null,null,"UHF","X","X","X","X","SINGLE","IB+XB","VRX1000 (UHF) Inband & Crossband; For APX (VHF+UHF+700+800) using Single-Band Antenna(s)",2,15,5,0,816,14,3,"No Drawing"]
[null,"X",null,null,null,"X","X",null,null,700,"X","X","X",null,"SINGLE","IB+XB","VRX1000 (700) Inband & Crossband; For APX (VHF+UHF+700) using Single-Band Antenna(s)",3,7,5,0,953,14,3,"No Drawing"]
[null,"X",null,null,null,"X","X",null,null,700,"X","X",null,"X","SINGLE","IB+XB","VRX1000 (700) Inband & Crossband; For APX (VHF+UHF+800) using Single-Band Antenna(s)",3,11,5,0,1021,14,3,"No Drawing"]
[null,"X",null,null,null,"X","X",null,null,700,"X","X","X","X","SINGLE","IB+XB","VRX1000 (700) Inband & Crossband; For APX (VHF+UHF+700+800) using Single-Band Antenna(s)",3,15,5,0,1089,14,3,"No Drawing"]
[null,"X",null,null,null,"X","X",null,null,800,"X","X","X",null,"SINGLE","IB+XB","VRX1000 (800) Inband & Crossband; For APX (VHF+UHF+700) using Single-Band Antenna(s)",4,7,5,0,1226,14,3,"No Drawing"]
[null,"X",null,null,null,"X","X",null,null,800,"X","X",null,"X","SINGLE","IB+XB","VRX1000 (800) Inband & Crossband; For APX (VHF+UHF+800) using Single-Band Antenna(s)",4,11,5,0,1294,14,3,"No Drawing"]
[null,"X",null,null,null,"X","X",null,null,800,"X","X","X","X","SINGLE","IB+XB","VRX1000 (800) Inband & Crossband; For APX (VHF+UHF+700+800) using Single-Band Antenna(s)",4,15,5,0,1362,14,3,"No Drawing"]
[null,"X",null,null,null,"X","X",null,null,"VHF","X","X","X",null,"SINGLE","IB-Only","VRX1000 (VHF) Inband/No Crossband; For APX (VHF+UHF+700) using Single-Band Antenna(s)",1,7,1,0,395,14,3,"No Drawing"]
[null,"X",null,null,null,"X","X",null,null,"VHF","X","X",null,"X","SINGLE","IB-Only","VRX1000 (VHF) Inband/No Crossband; For APX (VHF+UHF+800) using Single-Band Antenna(s)",1,11,1,0,463,14,3,"No Drawing"]
[null,"X",null,null,null,"X","X",null,null,"VHF","X","X","X","X","SINGLE","IB-Only","VRX1000 (VHF) Inband/No Crossband; For APX (VHF+UHF+700+800) using Single-Band Antenna(s)",1,15,1,0,531,14,3,"No Drawing"]
[null,"X",null,null,null,"X","X",null,null,"UHF","X","X","X",null,"SINGLE","IB-Only","VRX1000 (UHF) Inband/No Crossband; For APX (VHF+UHF+700) using Single-Band Antenna(s)",2,7,1,0,668,14,3,"No Drawing"]
[null,"X",null,null,null,"X","X",null,null,"UHF","X","X",null,"X","SINGLE","IB-Only","VRX1000 (UHF) Inband/No Crossband; For APX (VHF+UHF+800) using Single-Band Antenna(s)",2,11,1,0,736,14,3,"No Drawing"]
[null,"X",null,null,null,"X","X",null,null,"UHF","X","X","X","X","SINGLE","IB-Only","VRX1000 (UHF) Inband/No Crossband; For APX (VHF+UHF+700+800) using Single-Band Antenna(s)",2,15,1,0,804,14,3,"No Drawing"]
[null,"X",null,null,null,"X","X",null,null,700,"X","X","X",null,"SINGLE","IB-Only","VRX1000 (700) Inband/No Crossband; For APX (VHF+UHF+700) using Single-Band Antenna(s)",3,7,1,0,941,14,3,"No Drawing"]
[null,"X",null,null,null,"X","X",null,null,700,"X","X",null,"X","SINGLE","IB-Only","VRX1000 (700) Inband/No Crossband; For APX (VHF+UHF+800) using Single-Band Antenna(s)",3,11,1,0,1009,14,3,"No Drawing"]
[null,"X",null,null,null,"X","X",null,null,700,"X","X","X","X","SINGLE","IB-Only","VRX1000 (700) Inband/No Crossband; For APX (VHF+UHF+700+800) using Single-Band Antenna(s)",3,15,1,0,1077,14,3,"No Drawing"]
[null,"X",null,null,null,"X","X",null,null,800,"X","X","X",null,"SINGLE","IB-Only","VRX1000 (800) Inband/No Crossband; For APX (VHF+UHF+700) using Single-Band Antenna(s)",4,7,1,0,1214,14,3,"No Drawing"]
[null,"X",null,null,null,"X","X",null,null,800,"X","X",null,"X","SINGLE","IB-Only","VRX1000 (800) Inband/No Crossband; For APX (VHF+UHF+800) using Single-Band Antenna(s)",4,11,1,0,1282,14,3,"No Drawing"]
[null,"X",null,null,null,"X","X",null,null,800,"X","X","X","X","SINGLE","IB-Only","VRX1000 (800) Inband/No Crossband; For APX (VHF+UHF+700+800) using Single-Band Antenna(s)",4,15,1,0,1350,14,3,"No Drawing"]
[null,null,null,"X",null,"X","X",null,null,"VHF","X","X",null,null,"ALL","IB+XB","VRX1000 (VHF) Inband & Crossband; For APX (VHF+UHF) using One All-Band Antenna",1,3,5,1,340,16,2,"8J087X51-19"]
[null,null,null,"X",null,"X","X",null,null,"VHF","X","X",null,null,"USER","IB+XB","VRX1000 (VHF) Inband & Crossband; For APX (VHF+UHF) using Unknown or User-Defined Antenna",1,3,5,2,341,16,2,"No Drawing"]
[null,null,null,"X",null,"X","X",null,null,"VHF","X",null,"X",null,"ALL","IB+XB","VRX1000 (VHF) Inband & Crossband; For APX (VHF+700) using One All-Band Antenna",1,5,5,1,374,16,2,"8J087X51-20"]
[null,null,null,"X",null,"X","X",null,null,"VHF","X",null,"X",null,"USER","IB+XB","VRX1000 (VHF) Inband & Crossband; For APX (VHF+700) using Unknown or User-Defined Antenna",1,5,5,2,375,16,2,"No Drawing"]
[null,null,null,"X",null,"X","X",null,null,"VHF","X",null,null,"X","ALL","IB+XB","VRX1000 (VHF) Inband & Crossband; For APX (VHF+800) using One All-Band Antenna",1,9,5,1,442,16,2,"8J087X51-20"]
[null,null,null,"X",null,"X","X",null,null,"VHF","X",null,null,"X","USER","IB+XB","VRX1000 (VHF) Inband & Crossband; For APX (VHF+800) using Unknown or User-Defined Antenna",1,9,5,2,443,16,2,"No Drawing"]
[null,null,null,"X",null,"X","X",null,null,"VHF","X",null,"X","X","ALL","IB+XB","VRX1000 (VHF) Inband & Crossband; For APX (VHF+700+800) using One All-Band Antenna",1,13,5,1,510,16,2,"8J087X51-20"]
[null,null,null,"X",null,"X","X",null,null,"VHF","X",null,"X","X","USER","IB+XB","VRX1000 (VHF) Inband & Crossband; For APX (VHF+700+800) using Unknown or User-Defined Antenna",1,13,5,2,511,16,2,"No Drawing"]
[null,null,null,"X",null,"X","X",null,null,"UHF","X","X",null,null,"ALL","IB+XB","VRX1000 (UHF) Inband & Crossband; For APX (VHF+UHF) using One All-Band Antenna",2,3,5,1,613,16,2,"8J087X51-21"]
[null,null,null,"X",null,"X","X",null,null,"UHF","X","X",null,null,"USER","IB+XB","VRX1000 (UHF) Inband & Crossband; For APX (VHF+UHF) using Unknown or User-Defined Antenna",2,3,5,2,614,16,2,"No Drawing"]
[null,null,null,"X",null,"X","X",null,null,"UHF",null,"X","X",null,"ALL","IB+XB","VRX1000 (UHF) Inband & Crossband; For APX (UHF+700) using One All-Band Antenna",2,6,5,1,664,16,2,"8J087X51-22"]
[null,null,null,"X",null,"X","X",null,null,"UHF",null,"X","X",null,"USER","IB+XB","VRX1000 (UHF) Inband & Crossband; For APX (UHF+700) using Unknown or User-Defined Antenna",2,6,5,2,665,16,2,"No Drawing"]
[null,null,null,"X",null,"X","X",null,null,"UHF",null,"X",null,"X","ALL","IB+XB",{"$f":"$J$6&\"(\"&$J327&\")\"&\" \"&VLOOKUP($P327,RPTCodes,2,FALSE) &\"; For APX (\"&VLOOKUP($S327,BAND_NAMES,2)&\") using \"&VLOOKUP($O327,ANTcodes,3,FALSE)","v":"VRX1000 (UHF) Inband & Crossband; For APX (UHF+800) using One All-Band Antenna"},{"$f":"VLOOKUP(J327,Freq_Bands,2)","v":2},{"$f":"IF(K327=\"X\",1,0)+IF(L327=\"X\",2,0)+IF(M327=\"X\",4,0)+IF(N327=\"X\",8,0)","v":10},{"$f":"VLOOKUP(P327,RPTCodes,4,FALSE)","v":5},{"$f":"VLOOKUP(O327,ANTcodes,2,FALSE)","v":1},{"$f":"$U327*MULT_ANT+$T327*MULT_RPT+$S327*MULT_MRF+$R327*MULT_VRF","v":732},{"$f":"IF($A327=\"X\",1,0)+IF($B327=\"X\",2,0)+IF($C327=\"X\",3,0)+IF($D327=\"X\",4,0)+IF($E327=\"X\",5,0)+IF($F327=\"X\",6,0)+IF($H327=\"X\",10,0)+IF($G327=\"X\",6,0)","v":16},{"$f":"COUNTA(K327:L327)+IF(RIGHT(M327&N327,1)=\"X\",1,0)","v":2},"8J087X51-22"]
[null,null,null,"X",null,"X","X",null,null,"UHF",null,"X",null,"X","USER","IB+XB","VRX1000 (UHF) Inband & Crossband; For APX (UHF+800) using Unknown or User-Defined Antenna",2,10,5,2,733,16,2,"No Drawing"]
[null,null,null,"X",null,"X","X",null,null,"UHF",null,"X","X","X","ALL","IB+XB","VRX1000 (UHF) Inband & Crossband; For APX (UHF+700+800) using One All-Band Antenna",2,14,5,1,800,16,2,"8J087X51-22"]
[null,null,null,"X",null,"X","X",null,null,"UHF",null,"X","X","X","USER","IB+XB","VRX1000 (UHF) Inband & Crossband; For APX (UHF+700+800) using Unknown or User-Defined Antenna",2,14,5,2,801,16,2,"No Drawing"]
[null,null,null,"X",null,"X","X",null,null,700,"X",null,"X",null,"ALL","IB+XB","VRX1000 (700) Inband & Crossband; For APX (VHF+700) using One All-Band Antenna",3,5,5,1,920,16,2,"8J087X51-23"]
[null,null,null,"X",null,"X","X",null,null,700,"X",null,"X",null,"USER","IB+XB","VRX1000 (700) Inband & Crossband; For APX (VHF+700) using Unknown or User-Defined Antenna",3,5,5,2,921,16,2,"No Drawing"]
[null,null,null,"X",null,"X","X",null,null,700,null,"X","X",null,"ALL","IB+XB","VRX1000 (700) Inband & Crossband; For APX (UHF+700) using One All-Band Antenna",3,6,5,1,937,16,2,"8J087X51-24"]
[null,null,null,"X",null,"X","X",null,null,700,null,"X","X",null,"USER","IB+XB","VRX1000 (700) Inband & Crossband; For APX (UHF+700) using Unknown or User-Defined Antenna",3,6,5,2,938,16,2,"No Drawing"]
[null,null,null,"X",null,"X","X",null,null,700,"X",null,null,"X","ALL","IB+XB","VRX1000 (700) Inband & Crossband; For APX (VHF+800) using One All-Band Antenna",3,9,5,1,988,16,2,"8J087X51-23"]
[null,null,null,"X",null,"X","X",null,null,700,"X",null,null,"X","USER","IB+XB","VRX1000 (700) Inband & Crossband; For APX (VHF+800) using Unknown or User-Defined Antenna",3,9,5,2,989,16,2,"No Drawing"]
[null,null,null,"X",null,"X","X",null,null,700,null,"X",null,"X","ALL","IB+XB","VRX1000 (700) Inband & Crossband; For APX (UHF+800) using One All-Band Antenna",3,10,5,1,1005,16,2,"8J087X51-24"]
[null,null,null,"X",null,"X","X",null,null,700,null,"X",null,"X","USER","IB+XB","VRX1000 (700) Inband & Crossband; For APX (UHF+800) using Unknown or User-Defined Antenna",3,10,5,2,1006,16,2,"No Drawing"]
[null,null,null,"X",null,"X","X",null,null,700,"X",null,"X","X","ALL","IB+XB","VRX1000 (700) Inband & Crossband; For APX (VHF+700+800) using One All-Band Antenna",3,13,5,1,1056,16,2,"8J087X51-23"]
[null,null,null,"X",null,"X","X",null,null,700,"X",null,"X","X","USER","IB+XB","VRX1000 (700) Inband & Crossband; For APX (VHF+700+800) using Unknown or User-Defined Antenna",3,13,5,2,1057,16,2,"No Drawing"]
[null,null,null,"X",null,"X","X",null,null,700,null,"X","X","X","ALL","IB+XB","VRX1000 (700) Inband & Crossband; For APX (UHF+700+800) using One All-Band Antenna",3,14,5,1,1073,16,2,"8J087X51-24"]
[null,null,null,"X",null,"X","X",null,null,700,null,"X","X","X","USER","IB+XB","VRX1000 (700) Inband & Crossband; For APX (UHF+700+800) using Unknown or User-Defined Antenna",3,14,5,2,1074,16,2,"No Drawing"]
[null,null,null,"X",null,"X","X",null,null,800,"X",null,"X",null,"ALL","IB+XB","VRX1000 (800) Inband & Crossband; For APX (VHF+700) using One All-Band Antenna",4,5,5,1,1193,16,2,"8J087X51-23"]
[null,null,null,"X",null,"X","X",null,null,800,"X",null,"X",null,"USER","IB+XB","VRX1000 (800) Inband & Crossband; For APX (VHF+700) using Unknown or User-Defined Antenna",4,5,5,2,1194,16,2,"No Drawing"]
[null,null,null,"X",null,"X","X",null,null,800,null,"X","X",null,"ALL","IB+XB","VRX1000 (800) Inband & Crossband; For APX (UHF+700) using One All-Band Antenna",4,6,5,1,1210,16,2,"8J087X51-24"]
[null,null,null,"X",null,"X","X",null,null,800,null,"X","X",null,"USER","IB+XB","VRX1000 (800) Inband & Crossband; For APX (UHF+700) using Unknown or User-Defined Antenna",4,6,5,2,1211,16,2,"No Drawing"]
[null,null,null,"X",null,"X","X",null,null,800,"X",null,null,"X","ALL","IB+XB","VRX1000 (800) Inband & Crossband; For APX (VHF+800) using One All-Band Antenna",4,9,5,1,1261,16,2,"8J087X51-23"]
[null,null,null,"X",null,"X","X",null,null,800,"X",null,null,"X","USER","IB+XB","VRX1000 (800) Inband & Crossband; For APX (VHF+800) using Unknown or User-Defined Antenna",4,9,5,2,1262,16,2,"No Drawing"]
[null,null,null,"X",null,"X","X",null,null,800,null,"X",null,"X","ALL","IB+XB","VRX1000 (800) Inband & Crossband; For APX (UHF+800) using One All-Band Antenna",4,10,5,1,1278,16,2,"8J087X51-24"]
[null,null,null,"X",null,"X","X",null,null,800,null,"X",null,"X","USER","IB+XB","VRX1000 (800) Inband & Crossband; For APX (UHF+800) using Unknown or User-Defined Antenna",4,10,5,2,1279,16,2,"No Drawing"]
[null,null,null,"X",null,"X","X",null,null,800,"X",null,"X","X","ALL","IB+XB","VRX1000 (800) Inband & Crossband; For APX (VHF+700+800) using One All-Band Antenna",4,13,5,1,1329,16,2,"8J087X51-23"]
[null,null,null,"X",null,"X","X",null,null,800,"X",null,"X","X","USER","IB+XB","VRX1000 (800) Inband & Crossband; For APX (VHF+700+800) using Unknown or User-Defined Antenna",4,13,5,2,1330,16,2,"No Drawing"]
[null,null,null,"X",null,"X","X",null,null,800,null,"X","X","X","ALL","IB+XB","VRX1000 (800) Inband & Crossband; For APX (UHF+700+800) using One All-Band Antenna",4,14,5,1,1346,16,2,"8J087X51-24"]
[null,null,null,"X",null,"X","X",null,null,800,null,"X","X","X","USER","IB+XB","VRX1000 (800) Inband & Crossband; For APX (UHF+700+800) using Unknown or User-Defined Antenna",4,14,5,2,1347,16,2,"No Drawing"]
[null,null,null,"X",null,"X","X",null,null,"VHF","X","X","X",null,"ALL","IB+XB","VRX1000 (VHF) Inband & Crossband; For APX (VHF+UHF+700) using One All-Band Antenna",1,7,5,1,408,16,3,"8J087X51-31"]
[null,null,null,"X",null,"X","X",null,null,"VHF","X","X","X",null,"USER","IB+XB","VRX1000 (VHF) Inband & Crossband; For APX (VHF+UHF+700) using Unknown or User-Defined Antenna",1,7,5,2,409,16,3,"No Drawing"]
[null,null,null,"X",null,"X","X",null,null,"VHF","X","X",null,"X","ALL","IB+XB","VRX1000 (VHF) Inband & Crossband; For APX (VHF+UHF+800) using One All-Band Antenna",1,11,5,1,476,16,3,"8J087X51-31"]
[null,null,null,"X",null,"X","X",null,null,"VHF","X","X",null,"X","USER","IB+XB","VRX1000 (VHF) Inband & Crossband; For APX (VHF+UHF+800) using Unknown or User-Defined Antenna",1,11,5,2,477,16,3,"No Drawing"]
[null,null,null,"X",null,"X","X",null,null,"VHF","X","X","X","X","ALL","IB+XB","VRX1000 (VHF) Inband & Crossband; For APX (VHF+UHF+700+800) using One All-Band Antenna",1,15,5,1,544,16,3,"8J087X51-31"]
[null,null,null,"X",null,"X","X",null,null,"VHF","X","X","X","X","USER","IB+XB","VRX1000 (VHF) Inband & Crossband; For APX (VHF+UHF+700+800) using Unknown or User-Defined Antenna",1,15,5,2,545,16,3,"No Drawing"]
[null,null,null,"X",null,"X","X",null,null,"UHF","X","X","X",null,"ALL","IB+XB","VRX1000 (UHF) Inband & Crossband; For APX (VHF+UHF+700) using One All-Band Antenna",2,7,5,1,681,16,3,"8J087X51-32"]
[null,null,null,"X",null,"X","X",null,null,"UHF","X","X","X",null,"USER","IB+XB","VRX1000 (UHF) Inband & Crossband; For APX (VHF+UHF+700) using Unknown or User-Defined Antenna",2,7,5,2,682,16,3,"No Drawing"]
[null,null,null,"X",null,"X","X",null,null,"UHF","X","X",null,"X","ALL","IB+XB","VRX1000 (UHF) Inband & Crossband; For APX (VHF+UHF+800) using One All-Band Antenna",2,11,5,1,749,16,3,"8J087X51-32"]
[null,null,null,"X",null,"X","X",null,null,"UHF","X","X",null,"X","USER","IB+XB","VRX1000 (UHF) Inband & Crossband; For APX (VHF+UHF+800) using Unknown or User-Defined Antenna",2,11,5,2,750,16,3,"No Drawing"]
[null,null,null,"X",null,"X","X",null,null,"UHF","X","X","X","X","ALL","IB+XB","VRX1000 (UHF) Inband & Crossband; For APX (VHF+UHF+700+800) using One All-Band Antenna",2,15,5,1,817,16,3,"8J087X51-32"]
[null,null,null,"X",null,"X","X",null,null,"UHF","X","X","X","X","USER","IB+XB","VRX1000 (UHF) Inband & Crossband; For APX (VHF+UHF+700+800) using Unknown or User-Defined Antenna",2,15,5,2,818,16,3,"No Drawing"]
[null,null,null,"X",null,"X","X",null,null,700,"X","X","X",null,"ALL","IB+XB","VRX1000 (700) Inband & Crossband; For APX (VHF+UHF+700) using One All-Band Antenna",3,7,5,1,954,16,3,"8J087X51-33"]
[null,null,null,"X",null,"X","X",null,null,700,"X","X","X",null,"USER","IB+XB","VRX1000 (700) Inband & Crossband; For APX (VHF+UHF+700) using Unknown or User-Defined Antenna",3,7,5,2,955,16,3,"No Drawing"]
[null,null,null,"X",null,"X","X",null,null,700,"X","X",null,"X","ALL","IB+XB","VRX1000 (700) Inband & Crossband; For APX (VHF+UHF+800) using One All-Band Antenna",3,11,5,1,1022,16,3,"8J087X51-33"]
[null,null,null,"X",null,"X","X",null,null,700,"X","X",null,"X","USER","IB+XB","VRX1000 (700) Inband & Crossband; For APX (VHF+UHF+800) using Unknown or User-Defined Antenna",3,11,5,2,1023,16,3,"No Drawing"]
[null,null,null,"X",null,"X","X",null,null,700,"X","X","X","X","ALL","IB+XB","VRX1000 (700) Inband & Crossband; For APX (VHF+UHF+700+800) using One All-Band Antenna",3,15,5,1,1090,16,3,"8J087X51-33"]
[null,null,null,"X",null,"X","X",null,null,700,"X","X","X","X","USER","IB+XB","VRX1000 (700) Inband & Crossband; For APX (VHF+UHF+700+800) using Unknown or User-Defined Antenna",3,15,5,2,1091,16,3,"No Drawing"]
[null,null,null,"X",null,"X","X",null,null,800,"X","X","X",null,"ALL","IB+XB","VRX1000 (800) Inband & Crossband; For APX (VHF+UHF+700) using One All-Band Antenna",4,7,5,1,1227,16,3,"8J087X51-33"]
[null,null,null,"X",null,"X","X",null,null,800,"X","X","X",null,"USER","IB+XB","VRX1000 (800) Inband & Crossband; For APX (VHF+UHF+700) using Unknown or User-Defined Antenna",4,7,5,2,1228,16,3,"No Drawing"]
[null,null,null,"X",null,"X","X",null,null,800,"X","X",null,"X","ALL","IB+XB","VRX1000 (800) Inband & Crossband; For APX (VHF+UHF+800) using One All-Band Antenna",4,11,5,1,1295,16,3,"8J087X51-33"]
[null,null,null,"X",null,"X","X",null,null,800,"X","X",null,"X","USER","IB+XB","VRX1000 (800) Inband & Crossband; For APX (VHF+UHF+800) using Unknown or User-Defined Antenna",4,11,5,2,1296,16,3,"No Drawing"]
[null,null,null,"X",null,"X","X",null,null,800,"X","X","X","X","ALL","IB+XB","VRX1000 (800) Inband & Crossband; For APX (VHF+UHF+700+800) using One All-Band Antenna",4,15,5,1,1363,16,3,"8J087X51-33"]
[null,null,null,"X",null,"X","X",null,null,800,"X","X","X","X","USER","IB+XB","VRX1000 (800) Inband & Crossband; For APX (VHF+UHF+700+800) using Unknown or User-Defined Antenna",4,15,5,2,1364,16,3,"No Drawing"]

{"sheet":"MAIN -ORIGINAL","index":2,"n_rows":44,"n_cols":12,"rows_kept":44,"cut":false,"hidden":true,"merged":[[24,4,25,12],[28,4,29,12],[42,2,42,3]]}
[null,null,null,null,"SELECT ALL CHOICES BELOW FOR THE PROPOSED SYSTEM "]
[null,null,null,null,"RESULT IS LISTED AT BOTTOM"]
[]
[]
[]
[]
[]
[]
[]
[]
[]
[null,"APX 8500 Frequency Band Information",null,null,null,{"$f":"IF(Lookups!$K$16,\"ERROR: Please Check BANDS used by APX\",\"\")","v":""}]
[null,null,null,null,null,{"$f":"IF(Lookups!$P$17,\"ERROR: Please Check APX BAND where VR will be Used\",\"\")","v":""}]
[null,null,null,null,null,{"$f":"IF(Lookups!$P$16,\"ERROR: A Band chosen for APX-VR Repeat is not an APX Band\",\"\")","v":""}]
[]
[]
[]
[]
[null,null,null,null,null,null,null,null,null,null,"REFERENCE CONFIG:",{"$f":"Lookups!$B$16","v":543}]
[null,null,null,null,null,null,null,null,null,null,"FILTER TYPE:",{"$f":"Lookups!$M$29","v":14}]
[]
[]
[null,"REQUIRED FILTERING SOLUTION"]
[]
[null,null,null,"VR & APX Description:",{"$f":"Lookups!$M$28","v":"VRX1000 (VHF) Inband & Crossband; For APX (VHF+UHF+700+800) using Single-Band Antenna(s)"}]
[]
[null,"FILTERING REQUIRED (Listed Below)"]
[null,null,null,"FILTER DESCRIPTION:",{"$f":"Lookups!$M$30","v":"IN-BAND FILTER PACKAGE & APX Antenna TRIPLEXER"}]
[null,null,null,"ANTENNA NOTES:",{"$f":"Lookups!$M$31","v":"N/A"}]
[]
[null,null,null,"DRAWING NUMBER:",{"$f":"IF(VRcode=2,\"No Drawing\",Lookups!$M$33)","v":"No Drawing"}]
[]
[null,"ORDER THESE FILTERING KITS:"]
[null,"Quantity","Order Code",null,"Description"]
[null,{"$f":"VLOOKUP(FILTER_Code,AntennaFilters,5)","v":1},"See Order Guide",null,"In-Band Filtering Package (Mandatory unless '0' quantity shown)"]
[null,{"$f":"VLOOKUP(FILTER_Code,AntennaFilters,6)","v":1},"QA09450AA",null,"Antenna Triplexer (Required for APX Radio using multiple antennas)"]
[null,{"$f":"VLOOKUP(FILTER_Code,AntennaFilters,8)","v":0},"QA09449AA",null,"Single Triplexer & Bypass Relay Kit"]
[null,{"$f":"VLOOKUP(FILTER_Code,AntennaFilters,9)","v":0},"DDN2657A",null,"Dual Triplexer Kit"]
[null,{"$f":"VLOOKUP(FILTER_Code,AntennaFilters,10)","v":0},"QA09445AA",null,"Dual Triplexers & Bypass Relay Kit"]
[null,{"$f":"VLOOKUP(FILTER_Code,AntennaFilters,11)","v":0},"QA09446AA",null,"Filter Bypass Relay Kit"]
[null,{"$f":"VLOOKUP(FILTER_Code,AntennaFilters,14)","v":0},"Special",null,"SPECIAL ORDER - Engineering Review and Quote Required from Futurecom"]
[]
[null,"Form Rev:","2023-01-09"]
[null,"Form Ver.",3]

{"sheet":"VRX SOLUTIONS- MAP","index":3,"n_rows":378,"n_cols":25,"rows_kept":378,"cut":false,"hidden":true,"merged":[[2,6,2,7]]}
[null,null,null,null,null,null,null,null,"VRX FILTERING CONFIGURATOR"]
["SOLUTIONS REQUIRED"]
[null,"Kit-1","Kit-2","Kit-3","KIT-4","KIT-0","Kit-5",null,"VRX",null,null,null,null,null,null,null,null,"Lookup/Sorting Codes",null,null,null,null,"FilterCode"]
[1,2,3,4,5,6,6,10,null,"VRX","MSU FREQUENCY BANDS USED",null,null,null,"MSU "]
[null,"TRIPLEXER SOLUTION",null,null,null,"STANDARD","OPTION","Required","NOTES","BAND","b1","b2","b3a","b3b","ANT","REPEAT",null,4,16,4,2]
["NONE","1x","1x+Relay","2x","2x+Relay","In-BAND","Relay","Relay","NOTES","VRX1000 ","VHF","UHF",700,800,"MSU-Ant","TYPE","DESCRIPTION","VRF","MRF","RPT","ANT","TOTAl","FL","NumBands","Drawing"]
[null,"X",null,null,null,null,null,null,null,"VHF",null,"X",null,null,"SINGLE","XB-Forced",{"$f":"$J$6&\"(\"&$J7&\")\"&\" \"&VLOOKUP($P7,RPTCodes,2,FALSE) &\"; For APX (\"&VLOOKUP($S7,BAND_NAMES,2)&\") using \"&VLOOKUP($O7,ANTcodes,3,FALSE)","v":"VRX1000 (VHF) Crossband; For APX (UHF) using Single-Band Antenna(s)"},{"$f":"VLOOKUP(J7,Freq_Bands,2)","v":1},{"$f":"IF(K7=\"X\",1,0)+IF(L7=\"X\",2,0)+IF(M7=\"X\",4,0)+IF(N7=\"X\",8,0)","v":2},{"$f":"VLOOKUP(P7,RPTCodes,4,FALSE)","v":4},{"$f":"VLOOKUP(O7,ANTcodes,2,FALSE)","v":0},{"$f":"$U7*MULT_ANT+$T7*MULT_RPT+$S7*MULT_MRF+$R7*MULT_VRF","v":319},{"$f":"IF($A7=\"X\",1,0)+IF($B7=\"X\",2,0)+IF($C7=\"X\",3,0)+IF($D7=\"X\",4,0)+IF($E7=\"X\",5,0)+IF($F7=\"X\",6,0)+IF($H7=\"X\",10,0)+IF($G7=\"X\",6,0)","v":2},{"$f":"COUNTA(K7:L7)+IF(RIGHT(M7&N7,1)=\"X\",1,0)","v":1},"No Drawing"]
[null,"X",null,null,null,null,null,null,null,"VHF",null,"X",null,null,"ALL","XB-Forced","VRX1000 (VHF) Crossband; For APX (UHF) using One All-Band Antenna",1,2,4,1,320,2,1,"No Drawing"]
[null,"X",null,null,null,null,null,null,null,"VHF",null,"X",null,null,"USER","XB-Forced","VRX1000 (VHF) Crossband; For APX (UHF) using Unknown or User-Defined Antenna",1,2,4,2,321,2,1,"No Drawing"]
[null,"X",null,null,null,null,null,null,null,"VHF",null,null,"X",null,"SINGLE","XB-Forced","VRX1000 (VHF) Crossband; For APX (700) using Single-Band Antenna(s)",1,4,4,0,353,2,1,"No Drawing"]
[null,"X",null,null,null,null,null,null,null,"VHF",null,null,"X",null,"ALL","XB-Forced","VRX1000 (VHF) Crossband; For APX (700) using One All-Band Antenna",1,4,4,1,354,2,1,"No Drawing"]
[null,"X",null,null,null,null,null,null,null,"VHF",null,null,"X",null,"USER","XB-Forced","VRX1000 (VHF) Crossband; For APX (700) using Unknown or User-Defined Antenna",1,4,4,2,355,2,1,"No Drawing"]
[null,"X",null,null,null,null,null,null,null,"VHF",null,"X","X",null,"SINGLE","XB-Forced","VRX1000 (VHF) Crossband; For APX (UHF+700) using Single-Band Antenna(s)",1,6,4,0,387,2,2,"No Drawing"]
[null,"X",null,null,null,null,null,null,null,"VHF",null,null,null,"X","SINGLE","XB-Forced","VRX1000 (VHF) Crossband; For APX (800) using Single-Band Antenna(s)",1,8,4,0,421,2,1,"No Drawing"]
[null,"X",null,null,null,null,null,null,null,"VHF",null,null,null,"X","ALL","XB-Forced","VRX1000 (VHF) Crossband; For APX (800) using One All-Band Antenna",1,8,4,1,422,2,1,"No Drawing"]
[null,"X",null,null,null,null,null,null,null,"VHF",null,null,null,"X","USER","XB-Forced","VRX1000 (VHF) Crossband; For APX (800) using Unknown or User-Defined Antenna",1,8,4,2,423,2,1,"No Drawing"]
[null,"X",null,null,null,null,null,null,null,"VHF",null,"X",null,"X","SINGLE","XB-Forced","VRX1000 (VHF) Crossband; For APX (UHF+800) using Single-Band Antenna(s)",1,10,4,0,455,2,2,"No Drawing"]
[null,"X",null,null,null,null,null,null,null,"VHF",null,null,"X","X","SINGLE","XB-Forced","VRX1000 (VHF) Crossband; For APX (700+800) using Single-Band Antenna(s)",1,12,4,0,489,2,1,"No Drawing"]
[null,"X",null,null,null,null,null,null,null,"VHF",null,null,"X","X","ALL","XB-Forced","VRX1000 (VHF) Crossband; For APX (700+800) using One All-Band Antenna",1,12,4,1,490,2,1,"No Drawing"]
[null,"X",null,null,null,null,null,null,null,"VHF",null,null,"X","X","USER","XB-Forced","VRX1000 (VHF) Crossband; For APX (700+800) using Unknown or User-Defined Antenna",1,12,4,2,491,2,1,"No Drawing"]
[null,"X",null,null,null,null,null,null,null,"VHF",null,"X","X","X","SINGLE","XB-Forced","VRX1000 (VHF) Crossband; For APX (UHF+700+800) using Single-Band Antenna(s)",1,14,4,0,523,2,2,"No Drawing"]
[null,"X",null,null,null,null,null,null,null,"UHF","X",null,null,null,"SINGLE","XB-Forced","VRX1000 (UHF) Crossband; For APX (VHF) using Single-Band Antenna(s)",2,1,4,0,575,2,1,"No Drawing"]
[null,"X",null,null,null,null,null,null,null,"UHF","X",null,null,null,"ALL","XB-Forced","VRX1000 (UHF) Crossband; For APX (VHF) using One All-Band Antenna",2,1,4,1,576,2,1,"No Drawing"]
[null,"X",null,null,null,null,null,null,null,"UHF","X",null,null,null,"USER","XB-Forced","VRX1000 (UHF) Crossband; For APX (VHF) using Unknown or User-Defined Antenna",2,1,4,2,577,2,1,"No Drawing"]
[null,"X",null,null,null,null,null,null,null,"UHF",null,null,"X",null,"SINGLE","XB-Forced","VRX1000 (UHF) Crossband; For APX (700) using Single-Band Antenna(s)",2,4,4,0,626,2,1,"No Drawing"]
[null,"X",null,null,null,null,null,null,null,"UHF",null,null,"X",null,"ALL","XB-Forced","VRX1000 (UHF) Crossband; For APX (700) using One All-Band Antenna",2,4,4,1,627,2,1,"No Drawing"]
[null,"X",null,null,null,null,null,null,null,"UHF",null,null,"X",null,"USER","XB-Forced","VRX1000 (UHF) Crossband; For APX (700) using Unknown or User-Defined Antenna",2,4,4,2,628,2,1,"No Drawing"]
[null,"X",null,null,null,null,null,null,null,"UHF","X",null,"X",null,"SINGLE","XB-Forced","VRX1000 (UHF) Crossband; For APX (VHF+700) using Single-Band Antenna(s)",2,5,4,0,643,2,2,"No Drawing"]
[null,"X",null,null,null,null,null,null,null,"UHF",null,null,null,"X","SINGLE","XB-Forced","VRX1000 (UHF) Crossband; For APX (800) using Single-Band Antenna(s)",2,8,4,0,694,2,1,"No Drawing"]
[null,"X",null,null,null,null,null,null,null,"UHF",null,null,null,"X","ALL","XB-Forced","VRX1000 (UHF) Crossband; For APX (800) using One All-Band Antenna",2,8,4,1,695,2,1,"No Drawing"]
[null,"X",null,null,null,null,null,null,null,"UHF",null,null,null,"X","USER","XB-Forced","VRX1000 (UHF) Crossband; For APX (800) using Unknown or User-Defined Antenna",2,8,4,2,696,2,1,"No Drawing"]
[null,"X",null,null,null,null,null,null,null,"UHF","X",null,null,"X","SINGLE","XB-Forced","VRX1000 (UHF) Crossband; For APX (VHF+800) using Single-Band Antenna(s)",2,9,4,0,711,2,2,"No Drawing"]
[null,"X",null,null,null,null,null,null,null,"UHF",null,null,"X","X","SINGLE","XB-Forced","VRX1000 (UHF) Crossband; For APX (700+800) using Single-Band Antenna(s)",2,12,4,0,762,2,1,"No Drawing"]
[null,"X",null,null,null,null,null,null,null,"UHF",null,null,"X","X","ALL","XB-Forced","VRX1000 (UHF) Crossband; For APX (700+800) using One All-Band Antenna",2,12,4,1,763,2,1,"No Drawing"]
[null,"X",null,null,null,null,null,null,null,"UHF",null,null,"X","X","USER","XB-Forced","VRX1000 (UHF) Crossband; For APX (700+800) using Unknown or User-Defined Antenna",2,12,4,2,764,2,1,"No Drawing"]
[null,"X",null,null,null,null,null,null,null,"UHF","X",null,"X","=VLOOKUP('VRX SOLUTIONS'!B7:B162,'VRX SOLUTIONS'!,6)","SINGLE","XB-Forced","VRX1000 (UHF) Crossband; For APX (VHF+700) using Single-Band Antenna(s)",2,5,4,0,643,2,1,"No Drawing"]
[null,"X",null,null,null,null,null,null,null,700,"X",null,null,null,"SINGLE","XB-Forced","VRX1000 (700) Crossband; For APX (VHF) using Single-Band Antenna(s)",3,1,4,0,848,2,1,"No Drawing"]
[null,"X",null,null,null,null,null,null,null,700,"X",null,null,null,"ALL","XB-Forced","VRX1000 (700) Crossband; For APX (VHF) using One All-Band Antenna",3,1,4,1,849,2,1,"No Drawing"]
[null,"X",null,null,null,null,null,null,null,700,"X",null,null,null,"USER","XB-Forced","VRX1000 (700) Crossband; For APX (VHF) using Unknown or User-Defined Antenna",3,1,4,2,850,2,1,"No Drawing"]
[null,"X",null,null,null,null,null,null,null,700,null,"X",null,null,"SINGLE","XB-Forced","VRX1000 (700) Crossband; For APX (UHF) using Single-Band Antenna(s)",3,2,4,0,865,2,1,"No Drawing"]
[null,"X",null,null,null,null,null,null,null,700,null,"X",null,null,"ALL","XB-Forced","VRX1000 (700) Crossband; For APX (UHF) using One All-Band Antenna",3,2,4,1,866,2,1,"No Drawing"]
[null,"X",null,null,null,null,null,null,null,700,null,"X",null,null,"USER","XB-Forced","VRX1000 (700) Crossband; For APX (UHF) using Unknown or User-Defined Antenna",3,2,4,2,867,2,1,"No Drawing"]
[null,"X",null,null,null,null,null,null,null,700,"X","X",null,null,"SINGLE","XB-Forced","VRX1000 (700) Crossband; For APX (VHF+UHF) using Single-Band Antenna(s)",3,3,4,0,882,2,2,"No Drawing"]
[null,"X",null,null,null,null,null,null,null,800,"X",null,null,null,"SINGLE","XB-Forced","VRX1000 (800) Crossband; For APX (VHF) using Single-Band Antenna(s)",4,1,4,0,1121,2,1,"No Drawing"]
[null,"X",null,null,null,null,null,null,null,800,"X",null,null,null,"ALL","XB-Forced","VRX1000 (800) Crossband; For APX (VHF) using One All-Band Antenna",4,1,4,1,1122,2,1,"No Drawing"]
[null,"X",null,null,null,null,null,null,null,800,"X",null,null,null,"USER","XB-Forced","VRX1000 (800) Crossband; For APX (VHF) using Unknown or User-Defined Antenna",4,1,4,2,1123,2,1,"No Drawing"]
[null,"X",null,null,null,null,null,null,null,800,null,"X",null,null,"SINGLE","XB-Forced","VRX1000 (800) Crossband; For APX (UHF) using Single-Band Antenna(s)",4,2,4,0,1138,2,1,"No Drawing"]
[null,"X",null,null,null,null,null,null,null,800,null,"X",null,null,"ALL","XB-Forced","VRX1000 (800) Crossband; For APX (UHF) using One All-Band Antenna",4,2,4,1,1139,2,1,"No Drawing"]
[null,"X",null,null,null,null,null,null,null,800,null,"X",null,null,"USER","XB-Forced","VRX1000 (800) Crossband; For APX (UHF) using Unknown or User-Defined Antenna",4,2,4,2,1140,2,1,"No Drawing"]
[null,"X",null,null,null,null,null,null,null,800,"X","X",null,null,"SINGLE","XB-Forced","VRX1000 (800) Crossband; For APX (VHF+UHF) using Single-Band Antenna(s)",4,3,4,0,1155,2,2,"No Drawing"]
[null,null,"QA09484AA",null,null,null,null,null,null,"VHF","X","X",null,null,"ALL","XB-Only","VRX1000 (VHF) Crossband/No Inband; For APX (VHF+UHF) using One All-Band Antenna",1,3,3,1,334,0,2,"8J087X51-07"]
[null,null,"QA09484AA",null,null,null,null,null,null,"VHF","X","X",null,null,"USER","XB-Only","VRX1000 (VHF) Crossband/No Inband; For APX (VHF+UHF) using Unknown or User-Defined Antenna",1,3,3,2,335,0,2,"No Drawing"]
[null,null,"QA09484AA",null,null,null,null,null,null,"VHF","X",null,"X",null,"ALL","XB-Only","VRX1000 (VHF) Crossband/No Inband; For APX (VHF+700) using One All-Band Antenna",1,5,3,1,368,0,2,"8J087X51-08"]
[null,null,"QA09484AA",null,null,null,null,null,null,"VHF","X",null,"X",null,"USER","XB-Only","VRX1000 (VHF) Crossband/No Inband; For APX (VHF+700) using Unknown or User-Defined Antenna",1,5,3,2,369,0,2,"No Drawing"]
[null,null,"QA09484AA",null,null,null,null,null,null,"VHF","X",null,null,"X","ALL","XB-Only","VRX1000 (VHF) Crossband/No Inband; For APX (VHF+800) using One All-Band Antenna",1,9,3,1,436,0,2,"8J087X51-08"]
[null,null,"QA09484AA",null,null,null,null,null,null,"VHF","X",null,null,"X","USER","XB-Only","VRX1000 (VHF) Crossband/No Inband; For APX (VHF+800) using Unknown or User-Defined Antenna",1,9,3,2,437,0,2,"No Drawing"]
[null,null,"QA09484AA",null,null,null,null,null,null,"VHF","X",null,"X","X","ALL","XB-Only","VRX1000 (VHF) Crossband/No Inband; For APX (VHF+700+800) using One All-Band Antenna",1,13,3,1,504,0,2,"8J087X51-08"]
[null,null,"QA09484AA",null,null,null,null,null,null,"VHF","X",null,"X","X","USER","XB-Only","VRX1000 (VHF) Crossband/No Inband; For APX (VHF+700+800) using Unknown or User-Defined Antenna",1,13,3,2,505,0,2,"No Drawing"]
[null,null,"QA09485AA",null,null,null,null,null,null,"UHF","X","X",null,null,"ALL","XB-Only","VRX1000 (UHF) Crossband/No Inband; For APX (VHF+UHF) using One All-Band Antenna",2,3,3,1,607,0,2,"8J087X51-09"]
[null,null,"QA09485AA",null,null,null,null,null,null,"UHF","X","X",null,null,"USER","XB-Only","VRX1000 (UHF) Crossband/No Inband; For APX (VHF+UHF) using Unknown or User-Defined Antenna",2,3,3,2,608,0,2,"No Drawing"]
[null,null,"QA09485AA",null,null,null,null,null,null,"UHF",null,"X","X",null,"ALL","XB-Only","VRX1000 (UHF) Crossband/No Inband; For APX (UHF+700) using One All-Band Antenna",2,6,3,1,658,0,2,"8J087X51-10"]
[null,null,"QA09485AA",null,null,null,null,null,null,"UHF",null,"X","X",null,"USER","XB-Only","VRX1000 (UHF) Crossband/No Inband; For APX (UHF+700) using Unknown or User-Defined Antenna",2,6,3,2,659,0,2,"No Drawing"]
[null,null,"QA09485AA",null,null,null,null,null,null,"UHF",null,"X",null,"X","ALL","XB-Only","VRX1000 (UHF) Crossband/No Inband; For APX (UHF+800) using One All-Band Antenna",2,10,3,1,726,0,2,"8J087X51-10"]
[null,null,"QA09485AA",null,null,null,null,null,null,"UHF",null,"X",null,"X","USER","XB-Only","VRX1000 (UHF) Crossband/No Inband; For APX (UHF+800) using Unknown or User-Defined Antenna",2,10,3,2,727,0,2,"No Drawing"]
[null,null,"QA09485AA",null,null,null,null,null,null,"UHF",null,"X","X","X","ALL","XB-Only","VRX1000 (UHF) Crossband/No Inband; For APX (UHF+700+800) using One All-Band Antenna",2,14,3,1,794,0,2,"8J087X51-10"]
[null,null,"QA09485AA",null,null,null,null,null,null,"UHF",null,"X","X","X","USER","XB-Only","VRX1000 (UHF) Crossband/No Inband; For APX (UHF+700+800) using Unknown or User-Defined Antenna",2,14,3,2,795,0,2,"No Drawing"]
[null,null,"QA09486AA",null,null,null,null,null,null,700,"X",null,"X",null,"ALL","XB-Only","VRX1000 (700) Crossband/No Inband; For APX (VHF+700) using One All-Band Antenna",3,5,3,1,914,0,2,"8J087X51-11"]
[null,null,"QA09486AA",null,null,null,null,null,null,700,"X",null,"X",null,"USER","XB-Only","VRX1000 (700) Crossband/No Inband; For APX (VHF+700) using Unknown or User-Defined Antenna",3,5,3,2,915,0,2,"No Drawing"]
[null,null,"QA09486AA",null,null,null,null,null,null,700,null,"X","X",null,"ALL","XB-Only","VRX1000 (700) Crossband/No Inband; For APX (UHF+700) using One All-Band Antenna",3,6,3,1,931,0,2,"8J087X51-12"]
[null,null,"QA09486AA",null,null,null,null,null,null,700,null,"X","X",null,"USER","XB-Only","VRX1000 (700) Crossband/No Inband; For APX (UHF+700) using Unknown or User-Defined Antenna",3,6,3,2,932,0,2,"No Drawing"]
[null,null,"QA09486AA",null,null,null,null,null,null,700,"X",null,null,"X","ALL","XB-Only",{"$f":"$J$6&\"(\"&$J71&\")\"&\" \"&VLOOKUP($P71,RPTCodes,2,FALSE) &\"; For APX (\"&VLOOKUP($S71,BAND_NAMES,2)&\") using \"&VLOOKUP($O71,ANTcodes,3,FALSE)","v":"VRX1000 (700) Crossband/No Inband; For APX (VHF+800) using One All-Band Antenna"},{"$f":"VLOOKUP(J71,Freq_Bands,2)","v":3},{"$f":"IF(K71=\"X\",1,0)+IF(L71=\"X\",2,0)+IF(M71=\"X\",4,0)+IF(N71=\"X\",8,0)","v":9},{"$f":"VLOOKUP(P71,RPTCodes,4,FALSE)","v":3},{"$f":"VLOOKUP(O71,ANTcodes,2,FALSE)","v":1},{"$f":"$U71*MULT_ANT+$T71*MULT_RPT+$S71*MULT_MRF+$R71*MULT_VRF","v":982},{"$f":"IF($A71=\"X\",1,0)+IF($B71=\"X\",2,0)+IF($C71=\"X\",3,0)+IF($D71=\"X\",4,0)+IF($E71=\"X\",5,0)+IF($F71=\"X\",6,0)+IF($H71=\"X\",10,0)+IF($G71=\"X\",6,0)","v":0},{"$f":"COUNTA(K71:L71)+IF(RIGHT(M71&N71,1)=\"X\",1,0)","v":2},"8J087X51-11"]
[null,null,"QA09486AA",null,null,null,null,null,null,700,"X",null,null,"X","USER","XB-Only","VRX1000 (700) Crossband/No Inband; For APX (VHF+800) using Unknown or User-Defined Antenna",3,9,3,2,983,0,2,"No Drawing"]
[null,null,"QA09486AA",null,null,null,null,null,null,700,null,"X",null,"X","ALL","XB-Only","VRX1000 (700) Crossband/No Inband; For APX (UHF+800) using One All-Band Antenna",3,10,3,1,999,0,2,"8J087X51-12"]
[null,null,"QA09486AA",null,null,null,null,null,null,700,null,"X",null,"X","USER","XB-Only","VRX1000 (700) Crossband/No Inband; For APX (UHF+800) using Unknown or User-Defined Antenna",3,10,3,2,1000,0,2,"No Drawing"]
[null,null,"QA09486AA",null,null,null,null,null,null,700,"X",null,"X","X","ALL","XB-Only","VRX1000 (700) Crossband/No Inband; For APX (VHF+700+800) using One All-Band Antenna",3,13,3,1,1050,0,2,"8J087X51-11"]
[null,null,"QA09486AA",null,null,null,null,null,null,700,"X",null,"X","X","USER","XB-Only","VRX1000 (700) Crossband/No Inband; For APX (VHF+700+800) using Unknown or User-Defined Antenna",3,13,3,2,1051,0,2,"No Drawing"]
[null,null,"QA09486AA",null,null,null,null,null,null,700,null,"X","X","X","ALL","XB-Only","VRX1000 (700) Crossband/No Inband; For APX (UHF+700+800) using One All-Band Antenna",3,14,3,1,1067,0,2,"8J087X51-12"]
[null,null,"QA09486AA",null,null,null,null,null,null,700,null,"X","X","X","USER","XB-Only","VRX1000 (700) Crossband/No Inband; For APX (UHF+700+800) using Unknown or User-Defined Antenna",3,14,3,2,1068,0,2,"No Drawing"]
[null,null,"QA09486AA",null,null,null,null,null,null,800,"X",null,"X",null,"ALL","XB-Only","VRX1000 (800) Crossband/No Inband; For APX (VHF+700) using One All-Band Antenna",4,5,3,1,1187,0,2,"8J087X51-11"]
[null,null,"QA09486AA",null,null,null,null,null,null,800,"X",null,"X",null,"USER","XB-Only","VRX1000 (800) Crossband/No Inband; For APX (VHF+700) using Unknown or User-Defined Antenna",4,5,3,2,1188,0,2,"No Drawing"]
[null,null,"QA09486AA",null,null,null,null,null,null,800,null,"X","X",null,"ALL","XB-Only","VRX1000 (800) Crossband/No Inband; For APX (UHF+700) using One All-Band Antenna",4,6,3,1,1204,0,2,"8J087X51-12"]
[null,null,"QA09486AA",null,null,null,null,null,null,800,null,"X","X",null,"USER","XB-Only","VRX1000 (800) Crossband/No Inband; For APX (UHF+700) using Unknown or User-Defined Antenna",4,6,3,2,1205,0,2,"No Drawing"]
[null,null,"QA09486AA",null,null,null,null,null,null,800,"X",null,null,"X","ALL","XB-Only","VRX1000 (800) Crossband/No Inband; For APX (VHF+800) using One All-Band Antenna",4,9,3,1,1255,0,2,"8J087X51-11"]
[null,null,"QA09486AA",null,null,null,null,null,null,800,"X",null,null,"X","USER","XB-Only","VRX1000 (800) Crossband/No Inband; For APX (VHF+800) using Unknown or User-Defined Antenna",4,9,3,2,1256,0,2,"No Drawing"]
[null,null,"QA09486AA",null,null,null,null,null,null,800,null,"X",null,"X","ALL","XB-Only","VRX1000 (800) Crossband/No Inband; For APX (UHF+800) using One All-Band Antenna",4,10,3,1,1272,0,2,"8J087X51-12"]
[null,null,"QA09486AA",null,null,null,null,null,null,800,null,"X",null,"X","USER","XB-Only","VRX1000 (800) Crossband/No Inband; For APX (UHF+800) using Unknown or User-Defined Antenna",4,10,3,2,1273,0,2,"No Drawing"]
[null,null,"QA09486AA",null,null,null,null,null,null,800,"X",null,"X","X","ALL","XB-Only","VRX1000 (800) Crossband/No Inband; For APX (VHF+700+800) using One All-Band Antenna",4,13,3,1,1323,0,2,"8J087X51-11"]
[null,null,"QA09486AA",null,null,null,null,null,null,800,"X",null,"X","X","USER","XB-Only","VRX1000 (800) Crossband/No Inband; For APX (VHF+700+800) using Unknown or User-Defined Antenna",4,13,3,2,1324,0,2,"No Drawing"]
[null,null,"QA09486AA",null,null,null,null,null,null,800,null,"X","X","X","ALL","XB-Only","VRX1000 (800) Crossband/No Inband; For APX (UHF+700+800) using One All-Band Antenna",4,14,3,1,1340,0,2,"8J087X51-12"]
[null,null,"QA09486AA",null,null,null,null,null,null,800,null,"X","X","X","USER","XB-Only","VRX1000 (800) Crossband/No Inband; For APX (UHF+700+800) using Unknown or User-Defined Antenna",4,14,3,2,1341,0,2,"No Drawing"]
[null,null,null,"QA09447AA",null,null,null,null,null,"VHF",null,"X","X",null,"ALL","XB-Forced","VRX1000 (VHF) Crossband; For APX (UHF+700) using One All-Band Antenna",1,6,4,1,388,0,2,"8J087X51-13"]
[null,null,null,"QA09447AA",null,null,null,null,null,"VHF",null,"X","X",null,"USER","XB-Forced","VRX1000 (VHF) Crossband; For APX (UHF+700) using Unknown or User-Defined Antenna",1,6,4,2,389,0,2,"No Drawing"]
[null,null,null,"QA09447AA",null,null,null,null,null,"VHF",null,"X",null,"X","ALL","XB-Forced","VRX1000 (VHF) Crossband; For APX (UHF+800) using One All-Band Antenna",1,10,4,1,456,0,2,"8J087X51-13"]
[null,null,null,"QA09447AA",null,null,null,null,null,"VHF",null,"X",null,"X","USER","XB-Forced","VRX1000 (VHF) Crossband; For APX (UHF+800) using Unknown or User-Defined Antenna",1,10,4,2,457,0,2,"No Drawing"]
[null,null,null,"QA09447AA",null,null,null,null,null,"VHF",null,"X","X","X","ALL","XB-Forced","VRX1000 (VHF) Crossband; For APX (UHF+700+800) using One All-Band Antenna",1,14,4,1,524,0,2,"8J087X51-13"]
[null,null,null,"QA09447AA",null,null,null,null,null,"VHF",null,"X","X","X","USER","XB-Forced","VRX1000 (VHF) Crossband; For APX (UHF+700+800) using Unknown or User-Defined Antenna",1,14,4,2,525,0,2,"No Drawing"]
[null,null,null,"QA09447AA",null,null,null,null,null,"UHF","X",null,"X",null,"ALL","XB-Forced","VRX1000 (UHF) Crossband; For APX (VHF+700) using One All-Band Antenna",2,5,4,1,644,0,2,"8J087X51-14"]
[null,null,null,"QA09447AA",null,null,null,null,null,"UHF","X",null,"X",null,"USER","XB-Forced","VRX1000 (UHF) Crossband; For APX (VHF+700) using Unknown or User-Defined Antenna",2,5,4,2,645,0,2,"No Drawing"]
[null,null,null,"QA09447AA",null,null,null,null,null,"UHF","X",null,null,"X","ALL","XB-Forced","VRX1000 (UHF) Crossband; For APX (VHF+800) using One All-Band Antenna",2,9,4,1,712,0,2,"8J087X51-14"]
[null,null,null,"QA09447AA",null,null,null,null,null,"UHF","X",null,null,"X","USER","XB-Forced","VRX1000 (UHF) Crossband; For APX (VHF+800) using Unknown or User-Defined Antenna",2,9,4,2,713,0,2,"No Drawing"]
[null,null,null,"QA09447AA",null,null,null,null,null,"UHF","X",null,"X","X","ALL","XB-Forced","VRX1000 (UHF) Crossband; For APX (VHF+700+800) using One All-Band Antenna",2,13,4,1,780,0,2,"8J087X51-14"]
[null,null,null,"QA09447AA",null,null,null,null,null,"UHF","X",null,"X","X","USER","XB-Forced","VRX1000 (UHF) Crossband; For APX (VHF+700+800) using Unknown or User-Defined Antenna",2,13,4,2,781,0,2,"No Drawing"]
[null,null,null,"QA09447AA",null,null,null,null,null,700,"X","X",null,null,"ALL","XB-Forced","VRX1000 (700) Crossband; For APX (VHF+UHF) using One All-Band Antenna",3,3,4,1,883,0,2,"8J087X51-15"]
[null,null,null,"QA09447AA",null,null,null,null,null,700,"X","X",null,null,"USER","XB-Forced","VRX1000 (700) Crossband; For APX (VHF+UHF) using Unknown or User-Defined Antenna",3,3,4,2,884,0,2,"No Drawing"]
[null,null,null,"QA09447AA",null,null,null,null,null,800,"X","X",null,null,"ALL","XB-Forced","VRX1000 (800) Crossband; For APX (VHF+UHF) using One All-Band Antenna",4,3,4,1,1156,0,2,"8J087X51-15"]
[null,null,null,"QA09447AA",null,null,null,null,null,800,"X","X",null,null,"USER","XB-Forced","VRX1000 (800) Crossband; For APX (VHF+UHF) using Unknown or User-Defined Antenna",4,3,4,2,1157,0,2,"No Drawing"]
[null,null,null,null,"QA09489AA",null,null,null,null,"VHF","X","X","X",null,"ALL","XB-Only","VRX1000 (VHF) Crossband/No Inband; For APX (VHF+UHF+700) using One All-Band Antenna",1,7,3,1,402,0,3,"8J087X51-40"]
[null,null,null,null,"QA09489AA",null,null,null,null,"VHF","X","X","X",null,"USER","XB-Only","VRX1000 (VHF) Crossband/No Inband; For APX (VHF+UHF+700) using Unknown or User-Defined Antenna",1,7,3,2,403,0,3,"No Drawing"]
[null,null,null,null,"QA09489AA",null,null,null,null,"VHF","X","X",null,"X","ALL","XB-Only","VRX1000 (VHF) Crossband/No Inband; For APX (VHF+UHF+800) using One All-Band Antenna",1,11,3,1,470,0,3,"8J087X51-40"]
[null,null,null,null,"QA09489AA",null,null,null,null,"VHF","X","X",null,"X","USER","XB-Only","VRX1000 (VHF) Crossband/No Inband; For APX (VHF+UHF+800) using Unknown or User-Defined Antenna",1,11,3,2,471,0,3,"No Drawing"]
[null,null,null,null,"QA09489AA",null,null,null,null,"VHF","X","X","X","X","ALL","XB-Only","VRX1000 (VHF) Crossband/No Inband; For APX (VHF+UHF+700+800) using One All-Band Antenna",1,15,3,1,538,0,3,"8J087X51-40"]
[null,null,null,null,"QA09489AA",null,null,null,null,"VHF","X","X","X","X","USER","XB-Only","VRX1000 (VHF) Crossband/No Inband; For APX (VHF+UHF+700+800) using Unknown or User-Defined Antenna",1,15,3,2,539,0,3,"No Drawing"]
[null,null,null,null,"QA09490AA",null,null,null,null,"UHF","X","X","X",null,"ALL","XB-Only","VRX1000 (UHF) Crossband/No Inband; For APX (VHF+UHF+700) using One All-Band Antenna",2,7,3,1,675,0,3,"8J087X51-41"]
[null,null,null,null,"QA09490AA",null,null,null,null,"UHF","X","X","X",null,"USER","XB-Only","VRX1000 (UHF) Crossband/No Inband; For APX (VHF+UHF+700) using Unknown or User-Defined Antenna",2,7,3,2,676,0,3,"No Drawing"]
[null,null,null,null,"QA09490AA",null,null,null,null,"UHF","X","X",null,"X","ALL","XB-Only","VRX1000 (UHF) Crossband/No Inband; For APX (VHF+UHF+800) using One All-Band Antenna",2,11,3,1,743,0,3,"8J087X51-41"]
[null,null,null,null,"QA09490AA",null,null,null,null,"UHF","X","X",null,"X","USER","XB-Only","VRX1000 (UHF) Crossband/No Inband; For APX (VHF+UHF+800) using Unknown or User-Defined Antenna",2,11,3,2,744,0,3,"No Drawing"]
[null,null,null,null,"QA09490AA",null,null,null,null,"UHF","X","X","X","X","ALL","XB-Only","VRX1000 (UHF) Crossband/No Inband; For APX (VHF+UHF+700+800) using One All-Band Antenna",2,15,3,1,811,0,3,"8J087X51-41"]
[null,null,null,null,"QA09490AA",null,null,null,null,"UHF","X","X","X","X","USER","XB-Only","VRX1000 (UHF) Crossband/No Inband; For APX (VHF+UHF+700+800) using Unknown or User-Defined Antenna",2,15,3,2,812,0,3,"No Drawing"]
[null,null,null,null,"QA09491AA",null,null,null,null,700,"X","X","X",null,"ALL","XB-Only","VRX1000 (700) Crossband/No Inband; For APX (VHF+UHF+700) using One All-Band Antenna",3,7,3,1,948,0,3,"8J087X51-42"]
[null,null,null,null,"QA09491AA",null,null,null,null,700,"X","X","X",null,"USER","XB-Only","VRX1000 (700) Crossband/No Inband; For APX (VHF+UHF+700) using Unknown or User-Defined Antenna",3,7,3,2,949,0,3,"No Drawing"]
[null,null,null,null,"QA09491AA",null,null,null,null,700,"X","X",null,"X","ALL","XB-Only","VRX1000 (700) Crossband/No Inband; For APX (VHF+UHF+800) using One All-Band Antenna",3,11,3,1,1016,0,3,"8J087X51-42"]
[null,null,null,null,"QA09491AA",null,null,null,null,700,"X","X",null,"X","USER","XB-Only","VRX1000 (700) Crossband/No Inband; For APX (VHF+UHF+800) using Unknown or User-Defined Antenna",3,11,3,2,1017,0,3,"No Drawing"]
[null,null,null,null,"QA09491AA",null,null,null,null,700,"X","X","X","X","ALL","XB-Only","VRX1000 (700) Crossband/No Inband; For APX (VHF+UHF+700+800) using One All-Band Antenna",3,15,3,1,1084,0,3,"8J087X51-42"]
[null,null,null,null,"QA09491AA",null,null,null,null,700,"X","X","X","X","USER","XB-Only","VRX1000 (700) Crossband/No Inband; For APX (VHF+UHF+700+800) using Unknown or User-Defined Antenna",3,15,3,2,1085,0,3,"No Drawing"]
[null,null,null,null,"QA09491AA",null,null,null,null,800,"X","X","X",null,"ALL","XB-Only","VRX1000 (800) Crossband/No Inband; For APX (VHF+UHF+700) using One All-Band Antenna",4,7,3,1,1221,0,3,"8J087X51-42"]
[null,null,null,null,"QA09491AA",null,null,null,null,800,"X","X","X",null,"USER","XB-Only","VRX1000 (800) Crossband/No Inband; For APX (VHF+UHF+700) using Unknown or User-Defined Antenna",4,7,3,2,1222,0,3,"No Drawing"]
[null,null,null,null,"QA09491AA",null,null,null,null,800,"X","X",null,"X","ALL","XB-Only","VRX1000 (800) Crossband/No Inband; For APX (VHF+UHF+800) using One All-Band Antenna",4,11,3,1,1289,0,3,"8J087X51-42"]
[null,null,null,null,"QA09491AA",null,null,null,null,800,"X","X",null,"X","USER","XB-Only","VRX1000 (800) Crossband/No Inband; For APX (VHF+UHF+800) using Unknown or User-Defined Antenna",4,11,3,2,1290,0,3,"No Drawing"]
[null,null,null,null,"QA09491AA",null,null,null,null,800,"X","X","X","X","ALL","XB-Only","VRX1000 (800) Crossband/No Inband; For APX (VHF+UHF+700+800) using One All-Band Antenna",4,15,3,1,1357,0,3,"8J087X51-42"]
[null,null,null,null,"QA09491AA",null,null,null,null,800,"X","X","X","X","USER","XB-Only","VRX1000 (800) Crossband/No Inband; For APX (VHF+UHF+700+800) using Unknown or User-Defined Antenna",4,15,3,2,1358,0,3,"No Drawing"]
[null,"X",null,null,null,null,null,"Kit#TBD1",null,"VHF","X","X",null,null,"SINGLE","XB-Only","VRX1000 (VHF) Crossband/No Inband; For APX (VHF+UHF) using Single-Band Antenna(s)",1,3,3,0,333,2,2,"8J087X51-49"]
[null,"X",null,null,null,null,null,"Kit#TBD1",null,"VHF","X",null,"X",null,"SINGLE","XB-Only","VRX1000 (VHF) Crossband/No Inband; For APX (VHF+700) using Single-Band Antenna(s)",1,5,3,0,367,2,2,"8J087X51-50"]
[null,"X",null,null,null,null,null,"Kit#TBD1",null,"VHF","X","X","X",null,"SINGLE","XB-Only","VRX1000 (VHF) Crossband/No Inband; For APX (VHF+UHF+700) using Single-Band Antenna(s)",1,7,3,0,401,2,3,"8J087X51-58"]
[null,"X",null,null,null,null,null,"Kit#TBD1",null,"VHF","X",null,null,"X","SINGLE","XB-Only","VRX1000 (VHF) Crossband/No Inband; For APX (VHF+800) using Single-Band Antenna(s)",1,9,3,0,435,2,2,"8J087X51-50"]
[null,"X",null,null,null,null,null,"Kit#TBD1",null,"VHF","X","X",null,"X","SINGLE","XB-Only",{"$f":"$J$6&\"(\"&$J135&\")\"&\" \"&VLOOKUP($P135,RPTCodes,2,FALSE) &\"; For APX (\"&VLOOKUP($S135,BAND_NAMES,2)&\") using \"&VLOOKUP($O135,ANTcodes,3,FALSE)","v":"VRX1000 (VHF) Crossband/No Inband; For APX (VHF+UHF+800) using Single-Band Antenna(s)"},{"$f":"VLOOKUP(J135,Freq_Bands,2)","v":1},{"$f":"IF(K135=\"X\",1,0)+IF(L135=\"X\",2,0)+IF(M135=\"X\",4,0)+IF(N135=\"X\",8,0)","v":11},{"$f":"VLOOKUP(P135,RPTCodes,4,FALSE)","v":3},{"$f":"VLOOKUP(O135,ANTcodes,2,FALSE)","v":0},{"$f":"$U135*MULT_ANT+$T135*MULT_RPT+$S135*MULT_MRF+$R135*MULT_VRF","v":469},{"$f":"IF($A135=\"X\",1,0)+IF($B135=\"X\",2,0)+IF($C135=\"X\",3,0)+IF($D135=\"X\",4,0)+IF($E135=\"X\",5,0)+IF($F135=\"X\",6,0)+IF($H135=\"X\",10,0)+IF($G135=\"X\",6,0)","v":2},{"$f":"COUNTA(K135:L135)+IF(RIGHT(M135&N135,1)=\"X\",1,0)","v":3},"8J087X51-58"]
[null,"X",null,null,null,null,null,"Kit#TBD1",null,"VHF","X",null,"X","X","SINGLE","XB-Only","VRX1000 (VHF) Crossband/No Inband; For APX (VHF+700+800) using Single-Band Antenna(s)",1,13,3,0,503,2,2,"8J087X51-50"]
[null,"X",null,null,null,null,null,"Kit#TBD1",null,"VHF","X","X","X","X","SINGLE","XB-Only","VRX1000 (VHF) Crossband/No Inband; For APX (VHF+UHF+700+800) using Single-Band Antenna(s)",1,15,3,0,537,2,3,"8J087X51-58"]
[null,"X",null,null,null,null,null,"Kit#TBD1",null,"UHF","X","X",null,null,"SINGLE","XB-Only","VRX1000 (UHF) Crossband/No Inband; For APX (VHF+UHF) using Single-Band Antenna(s)",2,3,3,0,606,2,2,"8J087X51-51"]
[null,"X",null,null,null,null,null,"Kit#TBD1",null,"UHF",null,"X","X",null,"SINGLE","XB-Only","VRX1000 (UHF) Crossband/No Inband; For APX (UHF+700) using Single-Band Antenna(s)",2,6,3,0,657,2,2,"8J087X51-52"]
[null,"X",null,null,null,null,null,"Kit#TBD1",null,"UHF","X","X","X",null,"SINGLE","XB-Only","VRX1000 (UHF) Crossband/No Inband; For APX (VHF+UHF+700) using Single-Band Antenna(s)",2,7,3,0,674,2,3,"8J087X51-59"]
[null,"X",null,null,null,null,null,"Kit#TBD1",null,"UHF",null,"X",null,"X","SINGLE","XB-Only","VRX1000 (UHF) Crossband/No Inband; For APX (UHF+800) using Single-Band Antenna(s)",2,10,3,0,725,2,2,"8J087X51-52"]
[null,"X",null,null,null,null,null,"Kit#TBD1",null,"UHF","X","X",null,"X","SINGLE","XB-Only","VRX1000 (UHF) Crossband/No Inband; For APX (VHF+UHF+800) using Single-Band Antenna(s)",2,11,3,0,742,2,3,"8J087X51-59"]
[null,"X",null,null,null,null,null,"Kit#TBD1",null,"UHF",null,"X","X","X","SINGLE","XB-Only","VRX1000 (UHF) Crossband/No Inband; For APX (UHF+700+800) using Single-Band Antenna(s)",2,14,3,0,793,2,2,"8J087X51-52"]
[null,"X",null,null,null,null,null,"Kit#TBD1",null,"UHF","X","X","X","X","SINGLE","XB-Only","VRX1000 (UHF) Crossband/No Inband; For APX (VHF+UHF+700+800) using Single-Band Antenna(s)",2,15,3,0,810,2,3,"8J087X51-59"]
[null,"X",null,null,null,null,null,"Kit#TBD1",null,700,"X",null,"X",null,"SINGLE","XB-Only","VRX1000 (700) Crossband/No Inband; For APX (VHF+700) using Single-Band Antenna(s)",3,5,3,0,913,2,2,"8J087X51-53"]
[null,"X",null,null,null,null,null,"Kit#TBD1",null,700,null,"X","X",null,"SINGLE","XB-Only","VRX1000 (700) Crossband/No Inband; For APX (UHF+700) using Single-Band Antenna(s)",3,6,3,0,930,2,2,"8J087X51-54"]
[null,"X",null,null,null,null,null,"Kit#TBD1",null,700,"X","X","X",null,"SINGLE","XB-Only","VRX1000 (700) Crossband/No Inband; For APX (VHF+UHF+700) using Single-Band Antenna(s)",3,7,3,0,947,2,3,"8J087X51-60"]
[null,"X",null,null,null,null,null,"Kit#TBD1",null,700,"X",null,null,"X","SINGLE","XB-Only","VRX1000 (700) Crossband/No Inband; For APX (VHF+800) using Single-Band Antenna(s)",3,9,3,0,981,2,2,"8J087X51-53"]
[null,"X",null,null,null,null,null,"Kit#TBD1",null,700,null,"X",null,"X","SINGLE","XB-Only","VRX1000 (700) Crossband/No Inband; For APX (UHF+800) using Single-Band Antenna(s)",3,10,3,0,998,2,2,"8J087X51-54"]
[null,"X",null,null,null,null,null,"Kit#TBD1",null,700,"X","X",null,"X","SINGLE","XB-Only","VRX1000 (700) Crossband/No Inband; For APX (VHF+UHF+800) using Single-Band Antenna(s)",3,11,3,0,1015,2,3,"8J087X51-60"]
[null,"X",null,null,null,null,null,"Kit#TBD1",null,700,"X",null,"X","X","SINGLE","XB-Only","VRX1000 (700) Crossband/No Inband; For APX (VHF+700+800) using Single-Band Antenna(s)",3,13,3,0,1049,2,2,"8J087X51-53"]
[null,"X",null,null,null,null,null,"Kit#TBD1",null,700,null,"X","X","X","SINGLE","XB-Only","VRX1000 (700) Crossband/No Inband; For APX (UHF+700+800) using Single-Band Antenna(s)",3,14,3,0,1066,2,2,"8J087X51-54"]
[null,"X",null,null,null,null,null,"Kit#TBD1",null,700,"X","X","X","X","SINGLE","XB-Only","VRX1000 (700) Crossband/No Inband; For APX (VHF+UHF+700+800) using Single-Band Antenna(s)",3,15,3,0,1083,2,3,"8J087X51-60"]
[null,"X",null,null,null,null,null,"Kit#TBD1",null,800,"X",null,"X",null,"SINGLE","XB-Only","VRX1000 (800) Crossband/No Inband; For APX (VHF+700) using Single-Band Antenna(s)",4,5,3,0,1186,2,2,"8J087X51-53"]
[null,"X",null,null,null,null,null,"Kit#TBD1",null,800,null,"X","X",null,"SINGLE","XB-Only","VRX1000 (800) Crossband/No Inband; For APX (UHF+700) using Single-Band Antenna(s)",4,6,3,0,1203,2,2,"8J087X51-54"]
[null,"X",null,null,null,null,null,"Kit#TBD1",null,800,"X","X","X",null,"SINGLE","XB-Only","VRX1000 (800) Crossband/No Inband; For APX (VHF+UHF+700) using Single-Band Antenna(s)",4,7,3,0,1220,2,3,"8J087X51-60"]
[null,"X",null,null,null,null,null,"Kit#TBD1",null,800,"X",null,null,"X","SINGLE","XB-Only","VRX1000 (800) Crossband/No Inband; For APX (VHF+800) using Single-Band Antenna(s)",4,9,3,0,1254,2,2,"8J087X51-53"]
[null,"X",null,null,null,null,null,"Kit#TBD1",null,800,null,"X",null,"X","SINGLE","XB-Only","VRX1000 (800) Crossband/No Inband; For APX (UHF+800) using Single-Band Antenna(s)",4,10,3,0,1271,2,2,"8J087X51-54"]
[null,"X",null,null,null,null,null,"Kit#TBD1",null,800,"X","X",null,"X","SINGLE","XB-Only","VRX1000 (800) Crossband/No Inband; For APX (VHF+UHF+800) using Single-Band Antenna(s)",4,11,3,0,1288,2,3,"8J087X51-60"]
[null,"X",null,null,null,null,null,"Kit#TBD1",null,800,"X",null,"X","X","SINGLE","XB-Only","VRX1000 (800) Crossband/No Inband; For APX (VHF+700+800) using Single-Band Antenna(s)",4,13,3,0,1322,2,2,"8J087X51-53"]
[null,"X",null,null,null,null,null,"Kit#TBD1",null,800,null,"X","X","X","SINGLE","XB-Only","VRX1000 (800) Crossband/No Inband; For APX (UHF+700+800) using Single-Band Antenna(s)",4,14,3,0,1339,2,2,"8J087X51-54"]
[null,"X",null,null,null,null,null,"Kit#TBD1",null,800,"X","X","X","X","SINGLE","XB-Only","VRX1000 (800) Crossband/No Inband; For APX (VHF+UHF+700+800) using Single-Band Antenna(s)",4,15,3,0,1356,2,3,"8J087X51-60"]
["X",null,null,null,null,"X","X",null,null,"VHF","X",null,null,null,"SINGLE","IB-Forced","VRX1000 (VHF) Inband; For APX (VHF) using Single-Band Antenna(s)",1,1,2,0,296,13,1,"No Drawing"]
["X",null,null,null,null,"X","X",null,null,"VHF","X",null,null,null,"ALL","IB-Forced","VRX1000 (VHF) Inband; For APX (VHF) using One All-Band Antenna",1,1,2,1,297,13,1,"No Drawing"]
["X",null,null,null,null,"X","X",null,null,"VHF","X",null,null,null,"USER","IB-Forced","VRX1000 (VHF) Inband; For APX (VHF) using Unknown or User-Defined Antenna",1,1,2,2,298,13,1,"No Drawing"]
["X",null,null,null,null,"X","X",null,null,"UHF",null,"X",null,null,"SINGLE","IB-Forced","VRX1000 (UHF) Inband; For APX (UHF) using Single-Band Antenna(s)",2,2,2,0,586,13,1,"No Drawing"]
["X",null,null,null,null,"X","X",null,null,"UHF",null,"X",null,null,"ALL","IB-Forced","VRX1000 (UHF) Inband; For APX (UHF) using One All-Band Antenna",2,2,2,1,587,13,1,"No Drawing"]
["X",null,null,null,null,"X","X",null,null,"UHF",null,"X",null,null,"USER","IB-Forced","VRX1000 (UHF) Inband; For APX (UHF) using Unknown or User-Defined Antenna",2,2,2,2,588,13,1,"No Drawing"]
["X",null,null,null,null,"X","X",null,null,700,null,null,"X",null,"SINGLE","IB-Forced","VRX1000 (700) Inband; For APX (700) using Single-Band Antenna(s)",3,4,2,0,893,13,1,"No Drawing"]
["X",null,null,null,null,"X","X",null,null,700,null,null,"X",null,"ALL","IB-Forced","VRX1000 (700) Inband; For APX (700) using One All-Band Antenna",3,4,2,1,894,13,1,"No Drawing"]
["X",null,null,null,null,"X","X",null,null,700,null,null,"X",null,"USER","IB-Forced","VRX1000 (700) Inband; For APX (700) using Unknown or User-Defined Antenna",3,4,2,2,895,13,1,"No Drawing"]
["X",null,null,null,null,"X","X",null,null,700,null,null,null,"X","SINGLE","IB-Forced","VRX1000 (700) Inband; For APX (800) using Single-Band Antenna(s)",3,8,2,0,961,13,1,"No Drawing"]
["X",null,null,null,null,"X","X",null,null,700,null,null,null,"X","ALL","IB-Forced","VRX1000 (700) Inband; For APX (800) using One All-Band Antenna",3,8,2,1,962,13,1,"No Drawing"]
["X",null,null,null,null,"X","X",null,null,700,null,null,null,"X","USER","IB-Forced","VRX1000 (700) Inband; For APX (800) using Unknown or User-Defined Antenna",3,8,2,2,963,13,1,"No Drawing"]
["X",null,null,null,null,"X","X",null,null,700,null,null,"X","X","SINGLE","IB-Forced","VRX1000 (700) Inband; For APX (700+800) using Single-Band Antenna(s)",3,12,2,0,1029,13,1,"No Drawing"]
["X",null,null,null,null,"X","X",null,null,700,null,null,"X","X","ALL","IB-Forced","VRX1000 (700) Inband; For APX (700+800) using One All-Band Antenna",3,12,2,1,1030,13,1,"No Drawing"]
["X",null,null,null,null,"X","X",null,null,700,null,null,"X","X","USER","IB-Forced","VRX1000 (700) Inband; For APX (700+800) using Unknown or User-Defined Antenna",3,12,2,2,1031,13,1,"No Drawing"]
["X",null,null,null,null,"X","X",null,null,800,null,null,"X",null,"SINGLE","IB-Forced","VRX1000 (800) Inband; For APX (700) using Single-Band Antenna(s)",4,4,2,0,1166,13,1,"No Drawing"]
["X",null,null,null,null,"X","X",null,null,800,null,null,"X",null,"ALL","IB-Forced","VRX1000 (800) Inband; For APX (700) using One All-Band Antenna",4,4,2,1,1167,13,1,"No Drawing"]
["X",null,null,null,null,"X","X",null,null,800,null,null,"X",null,"USER","IB-Forced","VRX1000 (800) Inband; For APX (700) using Unknown or User-Defined Antenna",4,4,2,2,1168,13,1,"No Drawing"]
["X",null,null,null,null,"X","X",null,null,800,null,null,null,"X","SINGLE","IB-Forced","VRX1000 (800) Inband; For APX (800) using Single-Band Antenna(s)",4,8,2,0,1234,13,1,"No Drawing"]
["X",null,null,null,null,"X","X",null,null,800,null,null,null,"X","ALL","IB-Forced","VRX1000 (800) Inband; For APX (800) using One All-Band Antenna",4,8,2,1,1235,13,1,"No Drawing"]
["X",null,null,null,null,"X","X",null,null,800,null,null,null,"X","USER","IB-Forced","VRX1000 (800) Inband; For APX (800) using Unknown or User-Defined Antenna",4,8,2,2,1236,13,1,"No Drawing"]
["X",null,null,null,null,"X","X",null,null,800,null,null,"X","X","SINGLE","IB-Forced","VRX1000 (800) Inband; For APX (700+800) using Single-Band Antenna(s)",4,12,2,0,1302,13,1,"No Drawing"]
["X",null,null,null,null,"X","X",null,null,800,null,null,"X","X","ALL","IB-Forced","VRX1000 (800) Inband; For APX (700+800) using One All-Band Antenna",4,12,2,1,1303,13,1,"No Drawing"]
["X",null,null,null,null,"X","X",null,null,800,null,null,"X","X","USER","IB-Forced","VRX1000 (800) Inband; For APX (700+800) using Unknown or User-Defined Antenna",4,12,2,2,1304,13,1,"No Drawing"]
["X",null,null,null,null,"X","X",null,null,"VHF","X","X",null,null,"ALL","IB-Only","VRX1000 (VHF) Inband/No Crossband; For APX (VHF+UHF) using One All-Band Antenna",1,3,1,1,328,13,2,"No Drawing"]
["X",null,null,null,null,"X","X",null,null,"VHF","X","X",null,null,"USER","IB-Only","VRX1000 (VHF) Inband/No Crossband; For APX (VHF+UHF) using Unknown or User-Defined Antenna",1,3,1,2,329,13,2,"No Drawing"]
["X",null,null,null,null,"X","X",null,null,"VHF","X",null,"X",null,"ALL","IB-Only","VRX1000 (VHF) Inband/No Crossband; For APX (VHF+700) using One All-Band Antenna",1,5,1,1,362,13,2,"No Drawing"]
["X",null,null,null,null,"X","X",null,null,"VHF","X",null,"X",null,"USER","IB-Only","VRX1000 (VHF) Inband/No Crossband; For APX (VHF+700) using Unknown or User-Defined Antenna",1,5,1,2,363,13,2,"No Drawing"]
["X",null,null,null,null,"X","X",null,null,"VHF","X",null,null,"X","ALL","IB-Only","VRX1000 (VHF) Inband/No Crossband; For APX (VHF+800) using One All-Band Antenna",1,9,1,1,430,13,2,"No Drawing"]
["X",null,null,null,null,"X","X",null,null,"VHF","X",null,null,"X","USER","IB-Only","VRX1000 (VHF) Inband/No Crossband; For APX (VHF+800) using Unknown or User-Defined Antenna",1,9,1,2,431,13,2,"No Drawing"]
["X",null,null,null,null,"X","X",null,null,"VHF","X",null,"X","X","ALL","IB-Only","VRX1000 (VHF) Inband/No Crossband; For APX (VHF+700+800) using One All-Band Antenna",1,13,1,1,498,13,2,"No Drawing"]
["X",null,null,null,null,"X","X",null,null,"VHF","X",null,"X","X","USER","IB-Only","VRX1000 (VHF) Inband/No Crossband; For APX (VHF+700+800) using Unknown or User-Defined Antenna",1,13,1,2,499,13,2,"No Drawing"]
["X",null,null,null,null,"X","X",null,null,"UHF","X","X",null,null,"ALL","IB-Only","VRX1000 (UHF) Inband/No Crossband; For APX (VHF+UHF) using One All-Band Antenna",2,3,1,1,601,13,2,"No Drawing"]
["X",null,null,null,null,"X","X",null,null,"UHF","X","X",null,null,"USER","IB-Only","VRX1000 (UHF) Inband/No Crossband; For APX (VHF+UHF) using Unknown or User-Defined Antenna",2,3,1,2,602,13,2,"No Drawing"]
["X",null,null,null,null,"X","X",null,null,"UHF",null,"X","X",null,"ALL","IB-Only","VRX1000 (UHF) Inband/No Crossband; For APX (UHF+700) using One All-Band Antenna",2,6,1,1,652,13,2,"No Drawing"]
["X",null,null,null,null,"X","X",null,null,"UHF",null,"X","X",null,"USER","IB-Only","VRX1000 (UHF) Inband/No Crossband; For APX (UHF+700) using Unknown or User-Defined Antenna",2,6,1,2,653,13,2,"No Drawing"]
["X",null,null,null,null,"X","X",null,null,"UHF",null,"X",null,"X","ALL","IB-Only",{"$f":"$J$6&\"(\"&$J199&\")\"&\" \"&VLOOKUP($P199,RPTCodes,2,FALSE) &\"; For APX (\"&VLOOKUP($S199,BAND_NAMES,2)&\") using \"&VLOOKUP($O199,ANTcodes,3,FALSE)","v":"VRX1000 (UHF) Inband/No Crossband; For APX (UHF+800) using One All-Band Antenna"},{"$f":"VLOOKUP(J199,Freq_Bands,2)","v":2},{"$f":"IF(K199=\"X\",1,0)+IF(L199=\"X\",2,0)+IF(M199=\"X\",4,0)+IF(N199=\"X\",8,0)","v":10},{"$f":"VLOOKUP(P199,RPTCodes,4,FALSE)","v":1},{"$f":"VLOOKUP(O199,ANTcodes,2,FALSE)","v":1},{"$f":"$U199*MULT_ANT+$T199*MULT_RPT+$S199*MULT_MRF+$R199*MULT_VRF","v":720},{"$f":"IF($A199=\"X\",1,0)+IF($B199=\"X\",2,0)+IF($C199=\"X\",3,0)+IF($D199=\"X\",4,0)+IF($E199=\"X\",5,0)+IF($F199=\"X\",6,0)+IF($H199=\"X\",10,0)+IF($G199=\"X\",6,0)","v":13},{"$f":"COUNTA(K199:L199)+IF(RIGHT(M199&N199,1)=\"X\",1,0)","v":2},"No Drawing"]
["X",null,null,null,null,"X","X",null,null,"UHF",null,"X",null,"X","USER","IB-Only","VRX1000 (UHF) Inband/No Crossband; For APX (UHF+800) using Unknown or User-Defined Antenna",2,10,1,2,721,13,2,"No Drawing"]
["X",null,null,null,null,"X","X",null,null,"UHF",null,"X","X","X","ALL","IB-Only","VRX1000 (UHF) Inband/No Crossband; For APX (UHF+700+800) using One All-Band Antenna",2,14,1,1,788,13,2,"No Drawing"]
["X",null,null,null,null,"X","X",null,null,"UHF",null,"X","X","X","USER","IB-Only","VRX1000 (UHF) Inband/No Crossband; For APX (UHF+700+800) using Unknown or User-Defined Antenna",2,14,1,2,789,13,2,"No Drawing"]
["X",null,null,null,null,"X","X",null,null,700,"X",null,"X",null,"ALL","IB-Only","VRX1000 (700) Inband/No Crossband; For APX (VHF+700) using One All-Band Antenna",3,5,1,1,908,13,2,"No Drawing"]
["X",null,null,null,null,"X","X",null,null,700,"X",null,"X",null,"USER","IB-Only","VRX1000 (700) Inband/No Crossband; For APX (VHF+700) using Unknown or User-Defined Antenna",3,5,1,2,909,13,2,"No Drawing"]
["X",null,null,null,null,"X","X",null,null,700,null,"X","X",null,"ALL","IB-Only","VRX1000 (700) Inband/No Crossband; For APX (UHF+700) using One All-Band Antenna",3,6,1,1,925,13,2,"No Drawing"]
["X",null,null,null,null,"X","X",null,null,700,null,"X","X",null,"USER","IB-Only","VRX1000 (700) Inband/No Crossband; For APX (UHF+700) using Unknown or User-Defined Antenna",3,6,1,2,926,13,2,"No Drawing"]
["X",null,null,null,null,"X","X",null,null,700,"X",null,null,"X","ALL","IB-Only","VRX1000 (700) Inband/No Crossband; For APX (VHF+800) using One All-Band Antenna",3,9,1,1,976,13,2,"No Drawing"]
["X",null,null,null,null,"X","X",null,null,700,"X",null,null,"X","USER","IB-Only","VRX1000 (700) Inband/No Crossband; For APX (VHF+800) using Unknown or User-Defined Antenna",3,9,1,2,977,13,2,"No Drawing"]
["X",null,null,null,null,"X","X",null,null,700,null,"X",null,"X","ALL","IB-Only","VRX1000 (700) Inband/No Crossband; For APX (UHF+800) using One All-Band Antenna",3,10,1,1,993,13,2,"No Drawing"]
["X",null,null,null,null,"X","X",null,null,700,null,"X",null,"X","USER","IB-Only","VRX1000 (700) Inband/No Crossband; For APX (UHF+800) using Unknown or User-Defined Antenna",3,10,1,2,994,13,2,"No Drawing"]
["X",null,null,null,null,"X","X",null,null,700,"X",null,"X","X","ALL","IB-Only","VRX1000 (700) Inband/No Crossband; For APX (VHF+700+800) using One All-Band Antenna",3,13,1,1,1044,13,2,"No Drawing"]
["X",null,null,null,null,"X","X",null,null,700,"X",null,"X","X","USER","IB-Only","VRX1000 (700) Inband/No Crossband; For APX (VHF+700+800) using Unknown or User-Defined Antenna",3,13,1,2,1045,13,2,"No Drawing"]
["X",null,null,null,null,"X","X",null,null,700,null,"X","X","X","ALL","IB-Only","VRX1000 (700) Inband/No Crossband; For APX (UHF+700+800) using One All-Band Antenna",3,14,1,1,1061,13,2,"No Drawing"]
["X",null,null,null,null,"X","X",null,null,700,null,"X","X","X","USER","IB-Only","VRX1000 (700) Inband/No Crossband; For APX (UHF+700+800) using Unknown or User-Defined Antenna",3,14,1,2,1062,13,2,"No Drawing"]
["X",null,null,null,null,"X","X",null,null,800,"X",null,"X",null,"ALL","IB-Only","VRX1000 (800) Inband/No Crossband; For APX (VHF+700) using One All-Band Antenna",4,5,1,1,1181,13,2,"No Drawing"]
["X",null,null,null,null,"X","X",null,null,800,"X",null,"X",null,"USER","IB-Only","VRX1000 (800) Inband/No Crossband; For APX (VHF+700) using Unknown or User-Defined Antenna",4,5,1,2,1182,13,2,"No Drawing"]
["X",null,null,null,null,"X","X",null,null,800,null,"X","X",null,"ALL","IB-Only","VRX1000 (800) Inband/No Crossband; For APX (UHF+700) using One All-Band Antenna",4,6,1,1,1198,13,2,"No Drawing"]
["X",null,null,null,null,"X","X",null,null,800,null,"X","X",null,"USER","IB-Only","VRX1000 (800) Inband/No Crossband; For APX (UHF+700) using Unknown or User-Defined Antenna",4,6,1,2,1199,13,2,"No Drawing"]
["X",null,null,null,null,"X","X",null,null,800,"X",null,null,"X","ALL","IB-Only","VRX1000 (800) Inband/No Crossband; For APX (VHF+800) using One All-Band Antenna",4,9,1,1,1249,13,2,"No Drawing"]
["X",null,null,null,null,"X","X",null,null,800,"X",null,null,"X","USER","IB-Only","VRX1000 (800) Inband/No Crossband; For APX (VHF+800) using Unknown or User-Defined Antenna",4,9,1,2,1250,13,2,"No Drawing"]
["X",null,null,null,null,"X","X",null,null,800,null,"X",null,"X","ALL","IB-Only","VRX1000 (800) Inband/No Crossband; For APX (UHF+800) using One All-Band Antenna",4,10,1,1,1266,13,2,"No Drawing"]
["X",null,null,null,null,"X","X",null,null,800,null,"X",null,"X","USER","IB-Only","VRX1000 (800) Inband/No Crossband; For APX (UHF+800) using Unknown or User-Defined Antenna",4,10,1,2,1267,13,2,"No Drawing"]
["X",null,null,null,null,"X","X",null,null,800,"X",null,"X","X","ALL","IB-Only","VRX1000 (800) Inband/No Crossband; For APX (VHF+700+800) using One All-Band Antenna",4,13,1,1,1317,13,2,"No Drawing"]
["X",null,null,null,null,"X","X",null,null,800,"X",null,"X","X","USER","IB-Only","VRX1000 (800) Inband/No Crossband; For APX (VHF+700+800) using Unknown or User-Defined Antenna",4,13,1,2,1318,13,2,"No Drawing"]
["X",null,null,null,null,"X","X",null,null,800,null,"X","X","X","ALL","IB-Only","VRX1000 (800) Inband/No Crossband; For APX (UHF+700+800) using One All-Band Antenna",4,14,1,1,1334,13,2,"No Drawing"]
["X",null,null,null,null,"X","X",null,null,800,null,"X","X","X","USER","IB-Only","VRX1000 (800) Inband/No Crossband; For APX (UHF+700+800) using Unknown or User-Defined Antenna",4,14,1,2,1335,13,2,"No Drawing"]
["X",null,null,null,null,"X","X",null,null,"VHF","X","X","X",null,"ALL","IB-Only","VRX1000 (VHF) Inband/No Crossband; For APX (VHF+UHF+700) using One All-Band Antenna",1,7,1,1,396,13,3,"No Drawing"]
["X",null,null,null,null,"X","X",null,null,"VHF","X","X","X",null,"USER","IB-Only","VRX1000 (VHF) Inband/No Crossband; For APX (VHF+UHF+700) using Unknown or User-Defined Antenna",1,7,1,2,397,13,3,"No Drawing"]
["X",null,null,null,null,"X","X",null,null,"VHF","X","X",null,"X","ALL","IB-Only","VRX1000 (VHF) Inband/No Crossband; For APX (VHF+UHF+800) using One All-Band Antenna",1,11,1,1,464,13,3,"No Drawing"]
["X",null,null,null,null,"X","X",null,null,"VHF","X","X",null,"X","USER","IB-Only","VRX1000 (VHF) Inband/No Crossband; For APX (VHF+UHF+800) using Unknown or User-Defined Antenna",1,11,1,2,465,13,3,"No Drawing"]
["X",null,null,null,null,"X","X",null,null,"VHF","X","X","X","X","ALL","IB-Only","VRX1000 (VHF) Inband/No Crossband; For APX (VHF+UHF+700+800) using One All-Band Antenna",1,15,1,1,532,13,3,"No Drawing"]
["X",null,null,null,null,"X","X",null,null,"VHF","X","X","X","X","USER","IB-Only","VRX1000 (VHF) Inband/No Crossband; For APX (VHF+UHF+700+800) using Unknown or User-Defined Antenna",1,15,1,2,533,13,3,"No Drawing"]
["X",null,null,null,null,"X","X",null,null,"UHF","X","X","X",null,"ALL","IB-Only","VRX1000 (UHF) Inband/No Crossband; For APX (VHF+UHF+700) using One All-Band Antenna",2,7,1,1,669,13,3,"No Drawing"]
["X",null,null,null,null,"X","X",null,null,"UHF","X","X","X",null,"USER","IB-Only","VRX1000 (UHF) Inband/No Crossband; For APX (VHF+UHF+700) using Unknown or User-Defined Antenna",2,7,1,2,670,13,3,"No Drawing"]
["X",null,null,null,null,"X","X",null,null,"UHF","X","X",null,"X","ALL","IB-Only","VRX1000 (UHF) Inband/No Crossband; For APX (VHF+UHF+800) using One All-Band Antenna",2,11,1,1,737,13,3,"No Drawing"]
["X",null,null,null,null,"X","X",null,null,"UHF","X","X",null,"X","USER","IB-Only","VRX1000 (UHF) Inband/No Crossband; For APX (VHF+UHF+800) using Unknown or User-Defined Antenna",2,11,1,2,738,13,3,"No Drawing"]
["X",null,null,null,null,"X","X",null,null,"UHF","X","X","X","X","ALL","IB-Only","VRX1000 (UHF) Inband/No Crossband; For APX (VHF+UHF+700+800) using One All-Band Antenna",2,15,1,1,805,13,3,"No Drawing"]
["X",null,null,null,null,"X","X",null,null,"UHF","X","X","X","X","USER","IB-Only","VRX1000 (UHF) Inband/No Crossband; For APX (VHF+UHF+700+800) using Unknown or User-Defined Antenna",2,15,1,2,806,13,3,"No Drawing"]
["X",null,null,null,null,"X","X",null,null,700,"X","X","X",null,"ALL","IB-Only","VRX1000 (700) Inband/No Crossband; For APX (VHF+UHF+700) using One All-Band Antenna",3,7,1,1,942,13,3,"No Drawing"]
["X",null,null,null,null,"X","X",null,null,700,"X","X","X",null,"USER","IB-Only","VRX1000 (700) Inband/No Crossband; For APX (VHF+UHF+700) using Unknown or User-Defined Antenna",3,7,1,2,943,13,3,"No Drawing"]
["X",null,null,null,null,"X","X",null,null,700,"X","X",null,"X","ALL","IB-Only","VRX1000 (700) Inband/No Crossband; For APX (VHF+UHF+800) using One All-Band Antenna",3,11,1,1,1010,13,3,"No Drawing"]
["X",null,null,null,null,"X","X",null,null,700,"X","X",null,"X","USER","IB-Only","VRX1000 (700) Inband/No Crossband; For APX (VHF+UHF+800) using Unknown or User-Defined Antenna",3,11,1,2,1011,13,3,"No Drawing"]
["X",null,null,null,null,"X","X",null,null,700,"X","X","X","X","ALL","IB-Only","VRX1000 (700) Inband/No Crossband; For APX (VHF+UHF+700+800) using One All-Band Antenna",3,15,1,1,1078,13,3,"No Drawing"]
["X",null,null,null,null,"X","X",null,null,700,"X","X","X","X","USER","IB-Only","VRX1000 (700) Inband/No Crossband; For APX (VHF+UHF+700+800) using Unknown or User-Defined Antenna",3,15,1,2,1079,13,3,"No Drawing"]
["X",null,null,null,null,"X","X",null,null,800,"X","X","X",null,"ALL","IB-Only","VRX1000 (800) Inband/No Crossband; For APX (VHF+UHF+700) using One All-Band Antenna",4,7,1,1,1215,13,3,"No Drawing"]
["X",null,null,null,null,"X","X",null,null,800,"X","X","X",null,"USER","IB-Only","VRX1000 (800) Inband/No Crossband; For APX (VHF+UHF+700) using Unknown or User-Defined Antenna",4,7,1,2,1216,13,3,"No Drawing"]
["X",null,null,null,null,"X","X",null,null,800,"X","X",null,"X","ALL","IB-Only","VRX1000 (800) Inband/No Crossband; For APX (VHF+UHF+800) using One All-Band Antenna",4,11,1,1,1283,13,3,"No Drawing"]
["X",null,null,null,null,"X","X",null,null,800,"X","X",null,"X","USER","IB-Only","VRX1000 (800) Inband/No Crossband; For APX (VHF+UHF+800) using Unknown or User-Defined Antenna",4,11,1,2,1284,13,3,"No Drawing"]
["X",null,null,null,null,"X","X",null,null,800,"X","X","X","X","ALL","IB-Only","VRX1000 (800) Inband/No Crossband; For APX (VHF+UHF+700+800) using One All-Band Antenna",4,15,1,1,1351,13,3,"No Drawing"]
["X",null,null,null,null,"X","X",null,null,800,"X","X","X","X","USER","IB-Only","VRX1000 (800) Inband/No Crossband; For APX (VHF+UHF+700+800) using Unknown or User-Defined Antenna",4,15,1,2,1352,13,3,"No Drawing"]
[null,"X",null,null,null,"X","X",null,null,"VHF","X","X",null,null,"SINGLE","IB+XB","VRX1000 (VHF) Inband & Crossband; For APX (VHF+UHF) using Single-Band Antenna(s)",1,3,5,0,339,14,2,"No Drawing"]
[null,"X",null,null,null,"X","X",null,null,"VHF","X",null,"X",null,"SINGLE","IB+XB","VRX1000 (VHF) Inband & Crossband; For APX (VHF+700) using Single-Band Antenna(s)",1,5,5,0,373,14,2,"No Drawing"]
[null,"X",null,null,null,"X","X",null,null,"VHF","X",null,null,"X","SINGLE","IB+XB","VRX1000 (VHF) Inband & Crossband; For APX (VHF+800) using Single-Band Antenna(s)",1,9,5,0,441,14,2,"No Drawing"]
[null,"X",null,null,null,"X","X",null,null,"VHF","X",null,"X","X","SINGLE","IB+XB","VRX1000 (VHF) Inband & Crossband; For APX (VHF+700+800) using Single-Band Antenna(s)",1,13,5,0,509,14,2,"No Drawing"]
[null,"X",null,null,null,"X","X",null,null,"UHF","X","X",null,null,"SINGLE","IB+XB","VRX1000 (UHF) Inband & Crossband; For APX (VHF+UHF) using Single-Band Antenna(s)",2,3,5,0,612,14,2,"No Drawing"]
[null,"X",null,null,null,"X","X",null,null,"UHF",null,"X","X",null,"SINGLE","IB+XB","VRX1000 (UHF) Inband & Crossband; For APX (UHF+700) using Single-Band Antenna(s)",2,6,5,0,663,14,2,"No Drawing"]
[null,"X",null,null,null,"X","X",null,null,"UHF",null,"X",null,"X","SINGLE","IB+XB","VRX1000 (UHF) Inband & Crossband; For APX (UHF+800) using Single-Band Antenna(s)",2,10,5,0,731,14,2,"No Drawing"]
[null,"X",null,null,null,"X","X",null,null,"UHF",null,"X","X","X","SINGLE","IB+XB","VRX1000 (UHF) Inband & Crossband; For APX (UHF+700+800) using Single-Band Antenna(s)",2,14,5,0,799,14,2,"No Drawing"]
[null,"X",null,null,null,"X","X",null,null,700,"X",null,"X",null,"SINGLE","IB+XB","VRX1000 (700) Inband & Crossband; For APX (VHF+700) using Single-Band Antenna(s)",3,5,5,0,919,14,2,"No Drawing"]
[null,"X",null,null,null,"X","X",null,null,700,null,"X","X",null,"SINGLE","IB+XB","VRX1000 (700) Inband & Crossband; For APX (UHF+700) using Single-Band Antenna(s)",3,6,5,0,936,14,2,"No Drawing"]
[null,"X",null,null,null,"X","X",null,null,700,"X",null,null,"X","SINGLE","IB+XB","VRX1000 (700) Inband & Crossband; For APX (VHF+800) using Single-Band Antenna(s)",3,9,5,0,987,14,2,"No Drawing"]
[null,"X",null,null,null,"X","X",null,null,700,null,"X",null,"X","SINGLE","IB+XB","VRX1000 (700) Inband & Crossband; For APX (UHF+800) using Single-Band Antenna(s)",3,10,5,0,1004,14,2,"No Drawing"]
[null,"X",null,null,null,"X","X",null,null,700,"X",null,"X","X","SINGLE","IB+XB",{"$f":"$J$6&\"(\"&$J263&\")\"&\" \"&VLOOKUP($P263,RPTCodes,2,FALSE) &\"; For APX (\"&VLOOKUP($S263,BAND_NAMES,2)&\") using \"&VLOOKUP($O263,ANTcodes,3,FALSE)","v":"VRX1000 (700) Inband & Crossband; For APX (VHF+700+800) using Single-Band Antenna(s)"},{"$f":"VLOOKUP(J263,Freq_Bands,2)","v":3},{"$f":"IF(K263=\"X\",1,0)+IF(L263=\"X\",2,0)+IF(M263=\"X\",4,0)+IF(N263=\"X\",8,0)","v":13},{"$f":"VLOOKUP(P263,RPTCodes,4,FALSE)","v":5},{"$f":"VLOOKUP(O263,ANTcodes,2,FALSE)","v":0},{"$f":"$U263*MULT_ANT+$T263*MULT_RPT+$S263*MULT_MRF+$R263*MULT_VRF","v":1055},{"$f":"IF($A263=\"X\",1,0)+IF($B263=\"X\",2,0)+IF($C263=\"X\",3,0)+IF($D263=\"X\",4,0)+IF($E263=\"X\",5,0)+IF($F263=\"X\",6,0)+IF($H263=\"X\",10,0)+IF($G263=\"X\",6,0)","v":14},{"$f":"COUNTA(K263:L263)+IF(RIGHT(M263&N263,1)=\"X\",1,0)","v":2},"No Drawing"]
[null,"X",null,null,null,"X","X",null,null,700,null,"X","X","X","SINGLE","IB+XB","VRX1000 (700) Inband & Crossband; For APX (UHF+700+800) using Single-Band Antenna(s)",3,14,5,0,1072,14,2,"No Drawing"]
[null,"X",null,null,null,"X","X",null,null,800,"X",null,"X",null,"SINGLE","IB+XB","VRX1000 (800) Inband & Crossband; For APX (VHF+700) using Single-Band Antenna(s)",4,5,5,0,1192,14,2,"No Drawing"]
[null,"X",null,null,null,"X","X",null,null,800,null,"X","X",null,"SINGLE","IB+XB","VRX1000 (800) Inband & Crossband; For APX (UHF+700) using Single-Band Antenna(s)",4,6,5,0,1209,14,2,"No Drawing"]
[null,"X",null,null,null,"X","X",null,null,800,"X",null,null,"X","SINGLE","IB+XB","VRX1000 (800) Inband & Crossband; For APX (VHF+800) using Single-Band Antenna(s)",4,9,5,0,1260,14,2,"No Drawing"]
[null,"X",null,null,null,"X","X",null,null,800,null,"X",null,"X","SINGLE","IB+XB","VRX1000 (800) Inband & Crossband; For APX (UHF+800) using Single-Band Antenna(s)",4,10,5,0,1277,14,2,"No Drawing"]
[null,"X",null,null,null,"X","X",null,null,800,"X",null,"X","X","SINGLE","IB+XB","VRX1000 (800) Inband & Crossband; For APX (VHF+700+800) using Single-Band Antenna(s)",4,13,5,0,1328,14,2,"No Drawing"]
[null,"X",null,null,null,"X","X",null,null,800,null,"X","X","X","SINGLE","IB+XB","VRX1000 (800) Inband & Crossband; For APX (UHF+700+800) using Single-Band Antenna(s)",4,14,5,0,1345,14,2,"No Drawing"]
[null,"X",null,null,null,"X","X",null,null,"VHF","X","X",null,null,"SINGLE","IB-Only","VRX1000 (VHF) Inband/No Crossband; For APX (VHF+UHF) using Single-Band Antenna(s)",1,3,1,0,327,14,2,"No Drawing"]
[null,"X",null,null,null,"X","X",null,null,"VHF","X",null,"X",null,"SINGLE","IB-Only","VRX1000 (VHF) Inband/No Crossband; For APX (VHF+700) using Single-Band Antenna(s)",1,5,1,0,361,14,2,"No Drawing"]
[null,"X",null,null,null,"X","X",null,null,"VHF","X",null,null,"X","SINGLE","IB-Only","VRX1000 (VHF) Inband/No Crossband; For APX (VHF+800) using Single-Band Antenna(s)",1,9,1,0,429,14,2,"No Drawing"]
[null,"X",null,null,null,"X","X",null,null,"VHF","X",null,"X","X","SINGLE","IB-Only","VRX1000 (VHF) Inband/No Crossband; For APX (VHF+700+800) using Single-Band Antenna(s)",1,13,1,0,497,14,2,"No Drawing"]
[null,"X",null,null,null,"X","X",null,null,"UHF","X","X",null,null,"SINGLE","IB-Only","VRX1000 (UHF) Inband/No Crossband; For APX (VHF+UHF) using Single-Band Antenna(s)",2,3,1,0,600,14,2,"No Drawing"]
[null,"X",null,null,null,"X","X",null,null,"UHF",null,"X","X",null,"SINGLE","IB-Only","VRX1000 (UHF) Inband/No Crossband; For APX (UHF+700) using Single-Band Antenna(s)",2,6,1,0,651,14,2,"No Drawing"]
[null,"X",null,null,null,"X","X",null,null,"UHF",null,"X",null,"X","SINGLE","IB-Only","VRX1000 (UHF) Inband/No Crossband; For APX (UHF+800) using Single-Band Antenna(s)",2,10,1,0,719,14,2,"No Drawing"]
[null,"X",null,null,null,"X","X",null,null,"UHF",null,"X","X","X","SINGLE","IB-Only","VRX1000 (UHF) Inband/No Crossband; For APX (UHF+700+800) using Single-Band Antenna(s)",2,14,1,0,787,14,2,"No Drawing"]
[null,"X",null,null,null,"X","X",null,null,700,"X",null,"X",null,"SINGLE","IB-Only","VRX1000 (700) Inband/No Crossband; For APX (VHF+700) using Single-Band Antenna(s)",3,5,1,0,907,14,2,"No Drawing"]
[null,"X",null,null,null,"X","X",null,null,700,null,"X","X",null,"SINGLE","IB-Only","VRX1000 (700) Inband/No Crossband; For APX (UHF+700) using Single-Band Antenna(s)",3,6,1,0,924,14,2,"No Drawing"]
[null,"X",null,null,null,"X","X",null,null,700,"X",null,null,"X","SINGLE","IB-Only","VRX1000 (700) Inband/No Crossband; For APX (VHF+800) using Single-Band Antenna(s)",3,9,1,0,975,14,2,"No Drawing"]
[null,"X",null,null,null,"X","X",null,null,700,null,"X",null,"X","SINGLE","IB-Only","VRX1000 (700) Inband/No Crossband; For APX (UHF+800) using Single-Band Antenna(s)",3,10,1,0,992,14,2,"No Drawing"]
[null,"X",null,null,null,"X","X",null,null,700,"X",null,"X","X","SINGLE","IB-Only","VRX1000 (700) Inband/No Crossband; For APX (VHF+700+800) using Single-Band Antenna(s)",3,13,1,0,1043,14,2,"No Drawing"]
[null,"X",null,null,null,"X","X",null,null,700,null,"X","X","X","SINGLE","IB-Only","VRX1000 (700) Inband/No Crossband; For APX (UHF+700+800) using Single-Band Antenna(s)",3,14,1,0,1060,14,2,"No Drawing"]
[null,"X",null,null,null,"X","X",null,null,800,"X",null,"X",null,"SINGLE","IB-Only","VRX1000 (800) Inband/No Crossband; For APX (VHF+700) using Single-Band Antenna(s)",4,5,1,0,1180,14,2,"No Drawing"]
[null,"X",null,null,null,"X","X",null,null,800,null,"X","X",null,"SINGLE","IB-Only","VRX1000 (800) Inband/No Crossband; For APX (UHF+700) using Single-Band Antenna(s)",4,6,1,0,1197,14,2,"No Drawing"]
[null,"X",null,null,null,"X","X",null,null,800,"X",null,null,"X","SINGLE","IB-Only","VRX1000 (800) Inband/No Crossband; For APX (VHF+800) using Single-Band Antenna(s)",4,9,1,0,1248,14,2,"No Drawing"]
[null,"X",null,null,null,"X","X",null,null,800,null,"X",null,"X","SINGLE","IB-Only","VRX1000 (800) Inband/No Crossband; For APX (UHF+800) using Single-Band Antenna(s)",4,10,1,0,1265,14,2,"No Drawing"]
[null,"X",null,null,null,"X","X",null,null,800,"X",null,"X","X","SINGLE","IB-Only","VRX1000 (800) Inband/No Crossband; For APX (VHF+700+800) using Single-Band Antenna(s)",4,13,1,0,1316,14,2,"No Drawing"]
[null,"X",null,null,null,"X","X",null,null,800,null,"X","X","X","SINGLE","IB-Only","VRX1000 (800) Inband/No Crossband; For APX (UHF+700+800) using Single-Band Antenna(s)",4,14,1,0,1333,14,2,"No Drawing"]
[null,"X",null,null,null,"X","X",null,null,"VHF","X","X","X",null,"SINGLE","IB+XB","VRX1000 (VHF) Inband & Crossband; For APX (VHF+UHF+700) using Single-Band Antenna(s)",1,7,5,0,407,14,3,"No Drawing"]
[null,"X",null,null,null,"X","X",null,null,"VHF","X","X",null,"X","SINGLE","IB+XB","VRX1000 (VHF) Inband & Crossband; For APX (VHF+UHF+800) using Single-Band Antenna(s)",1,11,5,0,475,14,3,"No Drawing"]
[null,"X",null,null,null,"X","X",null,null,"VHF","X","X","X","X","SINGLE","IB+XB","VRX1000 (VHF) Inband & Crossband; For APX (VHF+UHF+700+800) using Single-Band Antenna(s)",1,15,5,0,543,14,3,"No Drawing"]
[null,"X",null,null,null,"X","X",null,null,"UHF","X","X","X",null,"SINGLE","IB+XB","VRX1000 (UHF) Inband & Crossband; For APX (VHF+UHF+700) using Single-Band Antenna(s)",2,7,5,0,680,14,3,"No Drawing"]
[null,"X",null,null,null,"X","X",null,null,"UHF","X","X",null,"X","SINGLE","IB+XB","VRX1000 (UHF) Inband & Crossband; For APX (VHF+UHF+800) using Single-Band Antenna(s)",2,11,5,0,748,14,3,"No Drawing"]
[null,"X",null,null,null,"X","X",null,null,"UHF","X","X","X","X","SINGLE","IB+XB","VRX1000 (UHF) Inband & Crossband; For APX (VHF+UHF+700+800) using Single-Band Antenna(s)",2,15,5,0,816,14,3,"No Drawing"]
[null,"X",null,null,null,"X","X",null,null,700,"X","X","X",null,"SINGLE","IB+XB","VRX1000 (700) Inband & Crossband; For APX (VHF+UHF+700) using Single-Band Antenna(s)",3,7,5,0,953,14,3,"No Drawing"]
[null,"X",null,null,null,"X","X",null,null,700,"X","X",null,"X","SINGLE","IB+XB","VRX1000 (700) Inband & Crossband; For APX (VHF+UHF+800) using Single-Band Antenna(s)",3,11,5,0,1021,14,3,"No Drawing"]
[null,"X",null,null,null,"X","X",null,null,700,"X","X","X","X","SINGLE","IB+XB","VRX1000 (700) Inband & Crossband; For APX (VHF+UHF+700+800) using Single-Band Antenna(s)",3,15,5,0,1089,14,3,"No Drawing"]
[null,"X",null,null,null,"X","X",null,null,800,"X","X","X",null,"SINGLE","IB+XB","VRX1000 (800) Inband & Crossband; For APX (VHF+UHF+700) using Single-Band Antenna(s)",4,7,5,0,1226,14,3,"No Drawing"]
[null,"X",null,null,null,"X","X",null,null,800,"X","X",null,"X","SINGLE","IB+XB","VRX1000 (800) Inband & Crossband; For APX (VHF+UHF+800) using Single-Band Antenna(s)",4,11,5,0,1294,14,3,"No Drawing"]
[null,"X",null,null,null,"X","X",null,null,800,"X","X","X","X","SINGLE","IB+XB","VRX1000 (800) Inband & Crossband; For APX (VHF+UHF+700+800) using Single-Band Antenna(s)",4,15,5,0,1362,14,3,"No Drawing"]
[null,"X",null,null,null,"X","X",null,null,"VHF","X","X","X",null,"SINGLE","IB-Only","VRX1000 (VHF) Inband/No Crossband; For APX (VHF+UHF+700) using Single-Band Antenna(s)",1,7,1,0,395,14,3,"No Drawing"]
[null,"X",null,null,null,"X","X",null,null,"VHF","X","X",null,"X","SINGLE","IB-Only","VRX1000 (VHF) Inband/No Crossband; For APX (VHF+UHF+800) using Single-Band Antenna(s)",1,11,1,0,463,14,3,"No Drawing"]
[null,"X",null,null,null,"X","X",null,null,"VHF","X","X","X","X","SINGLE","IB-Only","VRX1000 (VHF) Inband/No Crossband; For APX (VHF+UHF+700+800) using Single-Band Antenna(s)",1,15,1,0,531,14,3,"No Drawing"]
[null,"X",null,null,null,"X","X",null,null,"UHF","X","X","X",null,"SINGLE","IB-Only","VRX1000 (UHF) Inband/No Crossband; For APX (VHF+UHF+700) using Single-Band Antenna(s)",2,7,1,0,668,14,3,"No Drawing"]
[null,"X",null,null,null,"X","X",null,null,"UHF","X","X",null,"X","SINGLE","IB-Only","VRX1000 (UHF) Inband/No Crossband; For APX (VHF+UHF+800) using Single-Band Antenna(s)",2,11,1,0,736,14,3,"No Drawing"]
[null,"X",null,null,null,"X","X",null,null,"UHF","X","X","X","X","SINGLE","IB-Only","VRX1000 (UHF) Inband/No Crossband; For APX (VHF+UHF+700+800) using Single-Band Antenna(s)",2,15,1,0,804,14,3,"No Drawing"]
[null,"X",null,null,null,"X","X",null,null,700,"X","X","X",null,"SINGLE","IB-Only","VRX1000 (700) Inband/No Crossband; For APX (VHF+UHF+700) using Single-Band Antenna(s)",3,7,1,0,941,14,3,"No Drawing"]
[null,"X",null,null,null,"X","X",null,null,700,"X","X",null,"X","SINGLE","IB-Only","VRX1000 (700) Inband/No Crossband; For APX (VHF+UHF+800) using Single-Band Antenna(s)",3,11,1,0,1009,14,3,"No Drawing"]
[null,"X",null,null,null,"X","X",null,null,700,"X","X","X","X","SINGLE","IB-Only","VRX1000 (700) Inband/No Crossband; For APX (VHF+UHF+700+800) using Single-Band Antenna(s)",3,15,1,0,1077,14,3,"No Drawing"]
[null,"X",null,null,null,"X","X",null,null,800,"X","X","X",null,"SINGLE","IB-Only","VRX1000 (800) Inband/No Crossband; For APX (VHF+UHF+700) using Single-Band Antenna(s)",4,7,1,0,1214,14,3,"No Drawing"]
[null,"X",null,null,null,"X","X",null,null,800,"X","X",null,"X","SINGLE","IB-Only","VRX1000 (800) Inband/No Crossband; For APX (VHF+UHF+800) using Single-Band Antenna(s)",4,11,1,0,1282,14,3,"No Drawing"]
[null,"X",null,null,null,"X","X",null,null,800,"X","X","X","X","SINGLE","IB-Only","VRX1000 (800) Inband/No Crossband; For APX (VHF+UHF+700+800) using Single-Band Antenna(s)",4,15,1,0,1350,14,3,"No Drawing"]
[null,null,null,"QA09448AA",null,"X","X",null,null,"VHF","X","X",null,null,"ALL","IB+XB","VRX1000 (VHF) Inband & Crossband; For APX (VHF+UHF) using One All-Band Antenna",1,3,5,1,340,12,2,"8J087X51-19"]
[null,null,null,"QA09448AA",null,"X","X",null,null,"VHF","X","X",null,null,"USER","IB+XB","VRX1000 (VHF) Inband & Crossband; For APX (VHF+UHF) using Unknown or User-Defined Antenna",1,3,5,2,341,12,2,"No Drawing"]
[null,null,null,"QA09448AA",null,"X","X",null,null,"VHF","X",null,"X",null,"ALL","IB+XB","VRX1000 (VHF) Inband & Crossband; For APX (VHF+700) using One All-Band Antenna",1,5,5,1,374,12,2,"8J087X51-20"]
[null,null,null,"QA09448AA",null,"X","X",null,null,"VHF","X",null,"X",null,"USER","IB+XB","VRX1000 (VHF) Inband & Crossband; For APX (VHF+700) using Unknown or User-Defined Antenna",1,5,5,2,375,12,2,"No Drawing"]
[null,null,null,"QA09448AA",null,"X","X",null,null,"VHF","X",null,null,"X","ALL","IB+XB","VRX1000 (VHF) Inband & Crossband; For APX (VHF+800) using One All-Band Antenna",1,9,5,1,442,12,2,"8J087X51-20"]
[null,null,null,"QA09448AA",null,"X","X",null,null,"VHF","X",null,null,"X","USER","IB+XB","VRX1000 (VHF) Inband & Crossband; For APX (VHF+800) using Unknown or User-Defined Antenna",1,9,5,2,443,12,2,"No Drawing"]
[null,null,null,"QA09448AA",null,"X","X",null,null,"VHF","X",null,"X","X","ALL","IB+XB","VRX1000 (VHF) Inband & Crossband; For APX (VHF+700+800) using One All-Band Antenna",1,13,5,1,510,12,2,"8J087X51-20"]
[null,null,null,"QA09448AA",null,"X","X",null,null,"VHF","X",null,"X","X","USER","IB+XB","VRX1000 (VHF) Inband & Crossband; For APX (VHF+700+800) using Unknown or User-Defined Antenna",1,13,5,2,511,12,2,"No Drawing"]
[null,null,null,"QA09448AA",null,"X","X",null,null,"UHF","X","X",null,null,"ALL","IB+XB","VRX1000 (UHF) Inband & Crossband; For APX (VHF+UHF) using One All-Band Antenna",2,3,5,1,613,12,2,"8J087X51-21"]
[null,null,null,"QA09448AA",null,"X","X",null,null,"UHF","X","X",null,null,"USER","IB+XB","VRX1000 (UHF) Inband & Crossband; For APX (VHF+UHF) using Unknown or User-Defined Antenna",2,3,5,2,614,12,2,"No Drawing"]
[null,null,null,"QA09448AA",null,"X","X",null,null,"UHF",null,"X","X",null,"ALL","IB+XB","VRX1000 (UHF) Inband & Crossband; For APX (UHF+700) using One All-Band Antenna",2,6,5,1,664,12,2,"8J087X51-22"]
[null,null,null,"QA09448AA",null,"X","X",null,null,"UHF",null,"X","X",null,"USER","IB+XB","VRX1000 (UHF) Inband & Crossband; For APX (UHF+700) using Unknown or User-Defined Antenna",2,6,5,2,665,12,2,"No Drawing"]
[null,null,null,"QA09448AA",null,"X","X",null,null,"UHF",null,"X",null,"X","ALL","IB+XB",{"$f":"$J$6&\"(\"&$J327&\")\"&\" \"&VLOOKUP($P327,RPTCodes,2,FALSE) &\"; For APX (\"&VLOOKUP($S327,BAND_NAMES,2)&\") using \"&VLOOKUP($O327,ANTcodes,3,FALSE)","v":"VRX1000 (UHF) Inband & Crossband; For APX (UHF+800) using One All-Band Antenna"},{"$f":"VLOOKUP(J327,Freq_Bands,2)","v":2},{"$f":"IF(K327=\"X\",1,0)+IF(L327=\"X\",2,0)+IF(M327=\"X\",4,0)+IF(N327=\"X\",8,0)","v":10},{"$f":"VLOOKUP(P327,RPTCodes,4,FALSE)","v":5},{"$f":"VLOOKUP(O327,ANTcodes,2,FALSE)","v":1},{"$f":"$U327*MULT_ANT+$T327*MULT_RPT+$S327*MULT_MRF+$R327*MULT_VRF","v":732},{"$f":"IF($A327=\"X\",1,0)+IF($B327=\"X\",2,0)+IF($C327=\"X\",3,0)+IF($D327=\"X\",4,0)+IF($E327=\"X\",5,0)+IF($F327=\"X\",6,0)+IF($H327=\"X\",10,0)+IF($G327=\"X\",6,0)","v":12},{"$f":"COUNTA(K327:L327)+IF(RIGHT(M327&N327,1)=\"X\",1,0)","v":2},"8J087X51-22"]
[null,null,null,"QA09448AA",null,"X","X",null,null,"UHF",null,"X",null,"X","USER","IB+XB","VRX1000 (UHF) Inband & Crossband; For APX (UHF+800) using Unknown or User-Defined Antenna",2,10,5,2,733,12,2,"No Drawing"]
[null,null,null,"QA09448AA",null,"X","X",null,null,"UHF",null,"X","X","X","ALL","IB+XB","VRX1000 (UHF) Inband & Crossband; For APX (UHF+700+800) using One All-Band Antenna",2,14,5,1,800,12,2,"8J087X51-22"]
[null,null,null,"QA09448AA",null,"X","X",null,null,"UHF",null,"X","X","X","USER","IB+XB","VRX1000 (UHF) Inband & Crossband; For APX (UHF+700+800) using Unknown or User-Defined Antenna",2,14,5,2,801,12,2,"No Drawing"]
[null,null,null,"QA09448AA",null,"X","X",null,null,700,"X",null,"X",null,"ALL","IB+XB","VRX1000 (700) Inband & Crossband; For APX (VHF+700) using One All-Band Antenna",3,5,5,1,920,12,2,"8J087X51-23"]
[null,null,null,"QA09448AA",null,"X","X",null,null,700,"X",null,"X",null,"USER","IB+XB","VRX1000 (700) Inband & Crossband; For APX (VHF+700) using Unknown or User-Defined Antenna",3,5,5,2,921,12,2,"No Drawing"]
[null,null,null,"QA09448AA",null,"X","X",null,null,700,null,"X","X",null,"ALL","IB+XB","VRX1000 (700) Inband & Crossband; For APX (UHF+700) using One All-Band Antenna",3,6,5,1,937,12,2,"8J087X51-24"]
[null,null,null,"QA09448AA",null,"X","X",null,null,700,null,"X","X",null,"USER","IB+XB","VRX1000 (700) Inband & Crossband; For APX (UHF+700) using Unknown or User-Defined Antenna",3,6,5,2,938,12,2,"No Drawing"]
[null,null,null,"QA09448AA",null,"X","X",null,null,700,"X",null,null,"X","ALL","IB+XB","VRX1000 (700) Inband & Crossband; For APX (VHF+800) using One All-Band Antenna",3,9,5,1,988,12,2,"8J087X51-23"]
[null,null,null,"QA09448AA",null,"X","X",null,null,700,"X",null,null,"X","USER","IB+XB","VRX1000 (700) Inband & Crossband; For APX (VHF+800) using Unknown or User-Defined Antenna",3,9,5,2,989,12,2,"No Drawing"]
[null,null,null,"QA09448AA",null,"X","X",null,null,700,null,"X",null,"X","ALL","IB+XB","VRX1000 (700) Inband & Crossband; For APX (UHF+800) using One All-Band Antenna",3,10,5,1,1005,12,2,"8J087X51-24"]
[null,null,null,"QA09448AA",null,"X","X",null,null,700,null,"X",null,"X","USER","IB+XB","VRX1000 (700) Inband & Crossband; For APX (UHF+800) using Unknown or User-Defined Antenna",3,10,5,2,1006,12,2,"No Drawing"]
[null,null,null,"QA09448AA",null,"X","X",null,null,700,"X",null,"X","X","ALL","IB+XB","VRX1000 (700) Inband & Crossband; For APX (VHF+700+800) using One All-Band Antenna",3,13,5,1,1056,12,2,"8J087X51-23"]
[null,null,null,"QA09448AA",null,"X","X",null,null,700,"X",null,"X","X","USER","IB+XB","VRX1000 (700) Inband & Crossband; For APX (VHF+700+800) using Unknown or User-Defined Antenna",3,13,5,2,1057,12,2,"No Drawing"]
[null,null,null,"QA09448AA",null,"X","X",null,null,700,null,"X","X","X","ALL","IB+XB","VRX1000 (700) Inband & Crossband; For APX (UHF+700+800) using One All-Band Antenna",3,14,5,1,1073,12,2,"8J087X51-24"]
[null,null,null,"QA09448AA",null,"X","X",null,null,700,null,"X","X","X","USER","IB+XB","VRX1000 (700) Inband & Crossband; For APX (UHF+700+800) using Unknown or User-Defined Antenna",3,14,5,2,1074,12,2,"No Drawing"]
[null,null,null,"QA09448AA",null,"X","X",null,null,800,"X",null,"X",null,"ALL","IB+XB","VRX1000 (800) Inband & Crossband; For APX (VHF+700) using One All-Band Antenna",4,5,5,1,1193,12,2,"8J087X51-23"]
[null,null,null,"QA09448AA",null,"X","X",null,null,800,"X",null,"X",null,"USER","IB+XB","VRX1000 (800) Inband & Crossband; For APX (VHF+700) using Unknown or User-Defined Antenna",4,5,5,2,1194,12,2,"No Drawing"]
[null,null,null,"QA09448AA",null,"X","X",null,null,800,null,"X","X",null,"ALL","IB+XB","VRX1000 (800) Inband & Crossband; For APX (UHF+700) using One All-Band Antenna",4,6,5,1,1210,12,2,"8J087X51-24"]
[null,null,null,"QA09448AA",null,"X","X",null,null,800,null,"X","X",null,"USER","IB+XB","VRX1000 (800) Inband & Crossband; For APX (UHF+700) using Unknown or User-Defined Antenna",4,6,5,2,1211,12,2,"No Drawing"]
[null,null,null,"QA09448AA",null,"X","X",null,null,800,"X",null,null,"X","ALL","IB+XB","VRX1000 (800) Inband & Crossband; For APX (VHF+800) using One All-Band Antenna",4,9,5,1,1261,12,2,"8J087X51-23"]
[null,null,null,"QA09448AA",null,"X","X",null,null,800,"X",null,null,"X","USER","IB+XB","VRX1000 (800) Inband & Crossband; For APX (VHF+800) using Unknown or User-Defined Antenna",4,9,5,2,1262,12,2,"No Drawing"]
[null,null,null,"QA09448AA",null,"X","X",null,null,800,null,"X",null,"X","ALL","IB+XB","VRX1000 (800) Inband & Crossband; For APX (UHF+800) using One All-Band Antenna",4,10,5,1,1278,12,2,"8J087X51-24"]
[null,null,null,"QA09448AA",null,"X","X",null,null,800,null,"X",null,"X","USER","IB+XB","VRX1000 (800) Inband & Crossband; For APX (UHF+800) using Unknown or User-Defined Antenna",4,10,5,2,1279,12,2,"No Drawing"]
[null,null,null,"QA09448AA",null,"X","X",null,null,800,"X",null,"X","X","ALL","IB+XB","VRX1000 (800) Inband & Crossband; For APX (VHF+700+800) using One All-Band Antenna",4,13,5,1,1329,12,2,"8J087X51-23"]
[null,null,null,"QA09448AA",null,"X","X",null,null,800,"X",null,"X","X","USER","IB+XB","VRX1000 (800) Inband & Crossband; For APX (VHF+700+800) using Unknown or User-Defined Antenna",4,13,5,2,1330,12,2,"No Drawing"]
[null,null,null,"QA09448AA",null,"X","X",null,null,800,null,"X","X","X","ALL","IB+XB","VRX1000 (800) Inband & Crossband; For APX (UHF+700+800) using One All-Band Antenna",4,14,5,1,1346,12,2,"8J087X51-24"]
[null,null,null,"QA09448AA",null,"X","X",null,null,800,null,"X","X","X","USER","IB+XB","VRX1000 (800) Inband & Crossband; For APX (UHF+700+800) using Unknown or User-Defined Antenna",4,14,5,2,1347,12,2,"No Drawing"]
[null,null,null,"QA09448AA",null,"X","X",null,null,"VHF","X","X","X",null,"ALL","IB+XB","VRX1000 (VHF) Inband & Crossband; For APX (VHF+UHF+700) using One All-Band Antenna",1,7,5,1,408,12,3,"8J087X51-31"]
[null,null,null,"QA09448AA",null,"X","X",null,null,"VHF","X","X","X",null,"USER","IB+XB","VRX1000 (VHF) Inband & Crossband; For APX (VHF+UHF+700) using Unknown or User-Defined Antenna",1,7,5,2,409,12,3,"No Drawing"]
[null,null,null,"QA09448AA",null,"X","X",null,null,"VHF","X","X",null,"X","ALL","IB+XB","VRX1000 (VHF) Inband & Crossband; For APX (VHF+UHF+800) using One All-Band Antenna",1,11,5,1,476,12,3,"8J087X51-31"]
[null,null,null,"QA09448AA",null,"X","X",null,null,"VHF","X","X",null,"X","USER","IB+XB","VRX1000 (VHF) Inband & Crossband; For APX (VHF+UHF+800) using Unknown or User-Defined Antenna",1,11,5,2,477,12,3,"No Drawing"]
[null,null,null,"QA09448AA",null,"X","X",null,null,"VHF","X","X","X","X","ALL","IB+XB","VRX1000 (VHF) Inband & Crossband; For APX (VHF+UHF+700+800) using One All-Band Antenna",1,15,5,1,544,12,3,"8J087X51-31"]
[null,null,null,"QA09448AA",null,"X","X",null,null,"VHF","X","X","X","X","USER","IB+XB","VRX1000 (VHF) Inband & Crossband; For APX (VHF+UHF+700+800) using Unknown or User-Defined Antenna",1,15,5,2,545,12,3,"No Drawing"]
[null,null,null,"QA09448AA",null,"X","X",null,null,"UHF","X","X","X",null,"ALL","IB+XB","VRX1000 (UHF) Inband & Crossband; For APX (VHF+UHF+700) using One All-Band Antenna",2,7,5,1,681,12,3,"8J087X51-32"]
[null,null,null,"QA09448AA",null,"X","X",null,null,"UHF","X","X","X",null,"USER","IB+XB","VRX1000 (UHF) Inband & Crossband; For APX (VHF+UHF+700) using Unknown or User-Defined Antenna",2,7,5,2,682,12,3,"No Drawing"]
[null,null,null,"QA09448AA",null,"X","X",null,null,"UHF","X","X",null,"X","ALL","IB+XB","VRX1000 (UHF) Inband & Crossband; For APX (VHF+UHF+800) using One All-Band Antenna",2,11,5,1,749,12,3,"8J087X51-32"]
[null,null,null,"QA09448AA",null,"X","X",null,null,"UHF","X","X",null,"X","USER","IB+XB","VRX1000 (UHF) Inband & Crossband; For APX (VHF+UHF+800) using Unknown or User-Defined Antenna",2,11,5,2,750,12,3,"No Drawing"]
[null,null,null,"QA09448AA",null,"X","X",null,null,"UHF","X","X","X","X","ALL","IB+XB","VRX1000 (UHF) Inband & Crossband; For APX (VHF+UHF+700+800) using One All-Band Antenna",2,15,5,1,817,12,3,"8J087X51-32"]
[null,null,null,"QA09448AA",null,"X","X",null,null,"UHF","X","X","X","X","USER","IB+XB","VRX1000 (UHF) Inband & Crossband; For APX (VHF+UHF+700+800) using Unknown or User-Defined Antenna",2,15,5,2,818,12,3,"No Drawing"]
[null,null,null,"QA09448AA",null,"X","X",null,null,700,"X","X","X",null,"ALL","IB+XB","VRX1000 (700) Inband & Crossband; For APX (VHF+UHF+700) using One All-Band Antenna",3,7,5,1,954,12,3,"8J087X51-33"]
[null,null,null,"QA09448AA",null,"X","X",null,null,700,"X","X","X",null,"USER","IB+XB","VRX1000 (700) Inband & Crossband; For APX (VHF+UHF+700) using Unknown or User-Defined Antenna",3,7,5,2,955,12,3,"No Drawing"]
[null,null,null,"QA09448AA",null,"X","X",null,null,700,"X","X",null,"X","ALL","IB+XB","VRX1000 (700) Inband & Crossband; For APX (VHF+UHF+800) using One All-Band Antenna",3,11,5,1,1022,12,3,"8J087X51-33"]
[null,null,null,"QA09448AA",null,"X","X",null,null,700,"X","X",null,"X","USER","IB+XB","VRX1000 (700) Inband & Crossband; For APX (VHF+UHF+800) using Unknown or User-Defined Antenna",3,11,5,2,1023,12,3,"No Drawing"]
[null,null,null,"QA09448AA",null,"X","X",null,null,700,"X","X","X","X","ALL","IB+XB","VRX1000 (700) Inband & Crossband; For APX (VHF+UHF+700+800) using One All-Band Antenna",3,15,5,1,1090,12,3,"8J087X51-33"]
[null,null,null,"QA09448AA",null,"X","X",null,null,700,"X","X","X","X","USER","IB+XB","VRX1000 (700) Inband & Crossband; For APX (VHF+UHF+700+800) using Unknown or User-Defined Antenna",3,15,5,2,1091,12,3,"No Drawing"]
[null,null,null,"QA09448AA",null,"X","X",null,null,800,"X","X","X",null,"ALL","IB+XB","VRX1000 (800) Inband & Crossband; For APX (VHF+UHF+700) using One All-Band Antenna",4,7,5,1,1227,12,3,"8J087X51-33"]
[null,null,null,"QA09448AA",null,"X","X",null,null,800,"X","X","X",null,"USER","IB+XB","VRX1000 (800) Inband & Crossband; For APX (VHF+UHF+700) using Unknown or User-Defined Antenna",4,7,5,2,1228,12,3,"No Drawing"]
[null,null,null,"QA09448AA",null,"X","X",null,null,800,"X","X",null,"X","ALL","IB+XB","VRX1000 (800) Inband & Crossband; For APX (VHF+UHF+800) using One All-Band Antenna",4,11,5,1,1295,12,3,"8J087X51-33"]
[null,null,null,"QA09448AA",null,"X","X",null,null,800,"X","X",null,"X","USER","IB+XB","VRX1000 (800) Inband & Crossband; For APX (VHF+UHF+800) using Unknown or User-Defined Antenna",4,11,5,2,1296,12,3,"No Drawing"]
[null,null,null,"QA09448AA",null,"X","X",null,null,800,"X","X","X","X","ALL","IB+XB","VRX1000 (800) Inband & Crossband; For APX (VHF+UHF+700+800) using One All-Band Antenna",4,15,5,1,1363,12,3,"8J087X51-33"]
[null,null,null,"QA09448AA",null,"X","X",null,null,800,"X","X","X","X","USER","IB+XB","VRX1000 (800) Inband & Crossband; For APX (VHF+UHF+700+800) using Unknown or User-Defined Antenna",4,15,5,2,1364,12,3,"No Drawing"]

{"sheet":"DVR SOLUTIONS- MAP","index":4,"n_rows":402,"n_cols":26,"rows_kept":402,"cut":false,"hidden":true,"merged":[[2,6,2,7]]}
[null,null,null,null,null,null,null,null,"DVR FILTERING CONFIGURATOR"]
["SOLUTIONS REQUIRED"]
[null,"Kit-1","Kit-2","Kit-3","KIT-4","KIT-0","Kit-5",null,"DVR",null,null,null,null,null,null,null,null,"Lookup/Sorting Codes",null,null,null,null,"FilterCode"]
[1,2,3,4,5,6," ",10,null,"DVR","MSU FREQUENCY BANDS USED",null,null,null,"MSU "]
[null,"TRIPLEXER SOLUTION",null,null,null,"STANDARD","OPTION","Required","NOTES","BAND","b1","b2","b3a","b3b","ANT","REPEAT",null,4,16,4,2]
["NONE","1x","1x+Relay","2x","2x+Relay","In-BAND","Relay","Relay","NOTES","DVR ","VHF","UHF",700,800,"MSU-Ant","TYPE","DESCRIPTION","VRF","MRF","RPT","ANT","TOTAl","FL","NumBands","Drawing"]
["X",null,null,null,null,"X",null,null,null,"VHF","X",null,null,null,"SINGLE","IB-Forced",{"$f":"$J$6&\"(\"&$J7&\")\"&\" \"&VLOOKUP($P7,RPTCodes,2,FALSE) &\"; For APX (\"&VLOOKUP($S7,BAND_NAMES,2)&\") using \"&VLOOKUP($O7,ANTcodes,3,FALSE)","v":"DVR (VHF) Inband; For APX (VHF) using Single-Band Antenna(s)"},{"$f":"VLOOKUP(J7,Freq_Bands,2)","v":1},{"$f":"IF(K7=\"X\",1,0)+IF(L7=\"X\",2,0)+IF(M7=\"X\",4,0)+IF(N7=\"X\",8,0)","v":1},{"$f":"VLOOKUP(P7,RPTCodes,4,FALSE)","v":2},{"$f":"VLOOKUP(O7,ANTcodes,2,FALSE)","v":0},{"$f":"$U7*MULT_ANT+$T7*MULT_RPT+$S7*MULT_MRF+$R7*MULT_VRF","v":296},{"$f":"IF($A7=\"X\",1,0)+IF($B7=\"X\",2,0)+IF($C7=\"X\",3,0)+IF($D7=\"X\",4,0)+IF($E7=\"X\",5,0)+IF($F7=\"X\",6,0)+IF($H7=\"X\",10,0)","v":7},{"$f":"COUNTA(K7:L7)+IF(RIGHT(M7&N7,1)=\"X\",1,0)","v":1},"No Drawing",{"$f":"IF(COUNTIF($A7:$H7, \"<>\"&\"\")=0,\"INVALID COMBO\",\"\")","v":""}]
["X",null,null,null,null,"X",null,null,null,"VHF","X",null,null,null,"ALL","IB-Forced","DVR (VHF) Inband; For APX (VHF) using One All-Band Antenna",1,1,2,1,297,7,1,"No Drawing",""]
["X",null,null,null,null,"X",null,null,null,"VHF","X",null,null,null,"USER","IB-Forced","DVR (VHF) Inband; For APX (VHF) using Unknown or User-Defined Antenna",1,1,2,2,298,7,1,"No Drawing",""]
[null,null,null,null,null,null,null,null,"INVALID COMBO","VHF","X",null,null,null,"SINGLE","XB-Only","DVR (VHF) Crossband/No Inband; For APX (VHF) using Single-Band Antenna(s)",1,1,3,0,299,0,1,"No Drawing","INVALID COMBO"]
[null,null,null,null,null,null,null,null,"INVALID COMBO","VHF","X",null,null,null,"ALL","XB-Only","DVR (VHF) Crossband/No Inband; For APX (VHF) using One All-Band Antenna",1,1,3,1,300,0,1,"No Drawing","INVALID COMBO"]
[null,null,null,null,null,null,null,null,"INVALID COMBO","VHF","X",null,null,null,"USER","XB-Only","DVR (VHF) Crossband/No Inband; For APX (VHF) using Unknown or User-Defined Antenna",1,1,3,2,301,0,1,"No Drawing","INVALID COMBO"]
[null,"X",null,null,null,null,null,null,null,"VHF",null,"X",null,null,"SINGLE","XB-Forced","DVR (VHF) Crossband; For APX (UHF) using Single-Band Antenna(s)",1,2,4,0,319,2,1,"No Drawing",""]
[null,"X",null,null,null,null,null,null,null,"VHF",null,"X",null,null,"ALL","XB-Forced","DVR (VHF) Crossband; For APX (UHF) using One All-Band Antenna",1,2,4,1,320,2,1,"No Drawing",""]
[null,"X",null,null,null,null,null,null,null,"VHF",null,"X",null,null,"USER","XB-Forced","DVR (VHF) Crossband; For APX (UHF) using Unknown or User-Defined Antenna",1,2,4,2,321,2,1,"No Drawing",""]
[null,"X",null,null,null,"X",null,null,null,"VHF","X","X",null,null,"SINGLE","IB-Only","DVR (VHF) Inband/No Crossband; For APX (VHF+UHF) using Single-Band Antenna(s)",1,3,1,0,327,8,2,"No Drawing",""]
[null,null,null,null,null,"X",null,null,null,"VHF","X","X",null,null,"ALL","IB-Only","DVR (VHF) Inband/No Crossband; For APX (VHF+UHF) using One All-Band Antenna",1,3,1,1,328,6,2,"No Drawing",""]
[null,null,null,null,null,"X",null,null,null,"VHF","X","X",null,null,"USER","IB-Only","DVR (VHF) Inband/No Crossband; For APX (VHF+UHF) using Unknown or User-Defined Antenna",1,3,1,2,329,6,2,"No Drawing",""]
[null,"X",null,null,null,null,null,"QA09446AA",null,"VHF","X","X",null,null,"SINGLE","XB-Only","DVR (VHF) Crossband/No Inband; For APX (VHF+UHF) using Single-Band Antenna(s)",1,3,3,0,333,2,2,"8J087X51-43",""]
[null,null,"QA09482AA\n",null,null,null,null,null,null,"VHF","X","X",null,null,"ALL","XB-Only","DVR (VHF) Crossband/No Inband; For APX (VHF+UHF) using One All-Band Antenna",1,3,3,1,334,0,2,"8J087X51-01",""]
[null,null,"QA09482AA\n",null,null,null,null,null,null,"VHF","X","X",null,null,"USER","XB-Only","DVR (VHF) Crossband/No Inband; For APX (VHF+UHF) using Unknown or User-Defined Antenna",1,3,3,2,335,0,2,"No Drawing",""]
[null,"X",null,null,null,"X",null,null,null,"VHF","X","X",null,null,"SINGLE","IB+XB","DVR (VHF) Inband & Crossband; For APX (VHF+UHF) using Single-Band Antenna(s)",1,3,5,0,339,8,2,"No Drawing",""]
[null,null,null,"QA09448AA",null,"X",null,null,null,"VHF","X","X",null,null,"ALL","IB+XB","DVR (VHF) Inband & Crossband; For APX (VHF+UHF) using One All-Band Antenna",1,3,5,1,340,6,2,"8J087X51-25",""]
[null,null,null,"QA09448AA",null,"X",null,null,null,"VHF","X","X",null,null,"USER","IB+XB","DVR (VHF) Inband & Crossband; For APX (VHF+UHF) using Unknown or User-Defined Antenna",1,3,5,2,341,6,2,"No Drawing",""]
[null,"X",null,null,null,null,null,null,null,"VHF",null,null,"X",null,"SINGLE","XB-Forced","DVR (VHF) Crossband; For APX (700) using Single-Band Antenna(s)",1,4,4,0,353,2,1,"No Drawing",""]
[null,"X",null,null,null,null,null,null,null,"VHF",null,null,"X",null,"ALL","XB-Forced","DVR (VHF) Crossband; For APX (700) using One All-Band Antenna",1,4,4,1,354,2,1,"No Drawing",""]
[null,"X",null,null,null,null,null,null,null,"VHF",null,null,"X",null,"USER","XB-Forced","DVR (VHF) Crossband; For APX (700) using Unknown or User-Defined Antenna",1,4,4,2,355,2,1,"No Drawing",""]
[null,"X",null,null,null,"X",null,null,null,"VHF","X",null,"X",null,"SINGLE","IB-Only","DVR (VHF) Inband/No Crossband; For APX (VHF+700) using Single-Band Antenna(s)",1,5,1,0,361,8,2,"No Drawing",""]
[null,null,null,null,null,"X",null,null,null,"VHF","X",null,"X",null,"ALL","IB-Only","DVR (VHF) Inband/No Crossband; For APX (VHF+700) using One All-Band Antenna",1,5,1,1,362,6,2,"No Drawing",""]
[null,null,null,null,null,"X",null,null,null,"VHF","X",null,"X",null,"USER","IB-Only","DVR (VHF) Inband/No Crossband; For APX (VHF+700) using Unknown or User-Defined Antenna",1,5,1,2,363,6,2,"No Drawing",""]
[null,"X",null,null,null,null,null,"QA09446AA",null,"VHF","X",null,"X",null,"SINGLE","XB-Only","DVR (VHF) Crossband/No Inband; For APX (VHF+700) using Single-Band Antenna(s)",1,5,3,0,367,2,2,"8J087X51-44",""]
[null,null,"QA09482AA\n",null,null,null,null,null,null,"VHF","X",null,"X",null,"ALL","XB-Only","DVR (VHF) Crossband/No Inband; For APX (VHF+700) using One All-Band Antenna",1,5,3,1,368,0,2,"8J087X51-02",""]
[null,null,"QA09482AA\n",null,null,null,null,null,null,"VHF","X",null,"X",null,"USER","XB-Only","DVR (VHF) Crossband/No Inband; For APX (VHF+700) using Unknown or User-Defined Antenna",1,5,3,2,369,0,2,"No Drawing",""]
[null,"X",null,null,null,"X",null,null,null,"VHF","X",null,"X",null,"SINGLE","IB+XB","DVR (VHF) Inband & Crossband; For APX (VHF+700) using Single-Band Antenna(s)",1,5,5,0,373,8,2,"No Drawing",""]
[null,null,null,"QA09448AA",null,"X",null,null,null,"VHF","X",null,"X",null,"ALL","IB+XB","DVR (VHF) Inband & Crossband; For APX (VHF+700) using One All-Band Antenna",1,5,5,1,374,6,2,"8J087X51-26",""]
[null,null,null,"QA09448AA",null,"X",null,null,null,"VHF","X",null,"X",null,"USER","IB+XB","DVR (VHF) Inband & Crossband; For APX (VHF+700) using Unknown or User-Defined Antenna",1,5,5,2,375,6,2,"No Drawing",""]
[null,"X",null,null,null,null,null,null,null,"VHF",null,"X","X",null,"SINGLE","XB-Forced","DVR (VHF) Crossband; For APX (UHF+700) using Single-Band Antenna(s)",1,6,4,0,387,2,2,"No Drawing",""]
[null,null,null,"QA09447AA",null,null,null,null,null,"VHF",null,"X","X",null,"ALL","XB-Forced","DVR (VHF) Crossband; For APX (UHF+700) using One All-Band Antenna",1,6,4,1,388,0,2,"8J087X51-16",""]
[null,null,null,"QA09447AA",null,null,null,null,null,"VHF",null,"X","X",null,"USER","XB-Forced","DVR (VHF) Crossband; For APX (UHF+700) using Unknown or User-Defined Antenna",1,6,4,2,389,0,2,"No Drawing",""]
[null,"X",null,null,null,"X",null,null,null,"VHF","X","X","X",null,"SINGLE","IB-Only","DVR (VHF) Inband/No Crossband; For APX (VHF+UHF+700) using Single-Band Antenna(s)",1,7,1,0,395,8,3,"No Drawing",""]
[null,null,null,null,null,"X",null,null,null,"VHF","X","X","X",null,"ALL","IB-Only","DVR (VHF) Inband/No Crossband; For APX (VHF+UHF+700) using One All-Band Antenna",1,7,1,1,396,6,3,"No Drawing",""]
[null,null,null,null,null,"X",null,null,null,"VHF","X","X","X",null,"USER","IB-Only","DVR (VHF) Inband/No Crossband; For APX (VHF+UHF+700) using Unknown or User-Defined Antenna",1,7,1,2,397,6,3,"No Drawing",""]
[null,"X",null,null,null,null,null,"QA09446AA",null,"VHF","X","X","X",null,"SINGLE","XB-Only","DVR (VHF) Crossband/No Inband; For APX (VHF+UHF+700) using Single-Band Antenna(s)",1,7,3,0,401,2,3,"8J087X51-55",""]
[null,null,null,null,"QA09487AA",null,null,null,null,"VHF","X","X","X",null,"ALL","XB-Only","DVR (VHF) Crossband/No Inband; For APX (VHF+UHF+700) using One All-Band Antenna",1,7,3,1,402,0,3,"8J087X51-37",""]
[null,null,null,null,"QA09487AA",null,null,null,null,"VHF","X","X","X",null,"USER","XB-Only","DVR (VHF) Crossband/No Inband; For APX (VHF+UHF+700) using Unknown or User-Defined Antenna",1,7,3,2,403,0,3,"No Drawing",""]
[null,"X",null,null,null,"X",null,null,null,"VHF","X","X","X",null,"SINGLE","IB+XB","DVR (VHF) Inband & Crossband; For APX (VHF+UHF+700) using Single-Band Antenna(s)",1,7,5,0,407,8,3,"No Drawing",""]
[null,null,null,"QA09448AA",null,"X",null,null,null,"VHF","X","X","X",null,"ALL","IB+XB","DVR (VHF) Inband & Crossband; For APX (VHF+UHF+700) using One All-Band Antenna",1,7,5,1,408,6,3,"8J087X51-34",""]
[null,null,null,"QA09448AA",null,"X",null,null,null,"VHF","X","X","X",null,"USER","IB+XB","DVR (VHF) Inband & Crossband; For APX (VHF+UHF+700) using Unknown or User-Defined Antenna",1,7,5,2,409,6,3,"No Drawing",""]
[null,"X",null,null,null,null,null,null,null,"VHF",null,null,null,"X","SINGLE","XB-Forced","DVR (VHF) Crossband; For APX (800) using Single-Band Antenna(s)",1,8,4,0,421,2,1,"No Drawing",""]
[null,"X",null,null,null,null,null,null,null,"VHF",null,null,null,"X","ALL","XB-Forced","DVR (VHF) Crossband; For APX (800) using One All-Band Antenna",1,8,4,1,422,2,1,"No Drawing",""]
[null,"X",null,null,null,null,null,null,null,"VHF",null,null,null,"X","USER","XB-Forced","DVR (VHF) Crossband; For APX (800) using Unknown or User-Defined Antenna",1,8,4,2,423,2,1,"No Drawing",""]
[null,"X",null,null,null,"X",null,null,null,"VHF","X",null,null,"X","SINGLE","IB-Only","DVR (VHF) Inband/No Crossband; For APX (VHF+800) using Single-Band Antenna(s)",1,9,1,0,429,8,2,"No Drawing",""]
[null,null,null,null,null,"X",null,null,null,"VHF","X",null,null,"X","ALL","IB-Only","DVR (VHF) Inband/No Crossband; For APX (VHF+800) using One All-Band Antenna",1,9,1,1,430,6,2,"No Drawing",""]
[null,null,null,null,null,"X",null,null,null,"VHF","X",null,null,"X","USER","IB-Only","DVR (VHF) Inband/No Crossband; For APX (VHF+800) using Unknown or User-Defined Antenna",1,9,1,2,431,6,2,"No Drawing",""]
[null,"X",null,null,null,null,null,"QA09446AA",null,"VHF","X",null,null,"X","SINGLE","XB-Only","DVR (VHF) Crossband/No Inband; For APX (VHF+800) using Single-Band Antenna(s)",1,9,3,0,435,2,2,"8J087X51-44",""]
[null,null,"QA09482AA",null,null,null,null,null,null,"VHF","X",null,null,"X","ALL","XB-Only","DVR (VHF) Crossband/No Inband; For APX (VHF+800) using One All-Band Antenna",1,9,3,1,436,0,2,"8J087X51-02",""]
[null,null,"QA09482AA",null,null,null,null,null,null,"VHF","X",null,null,"X","USER","XB-Only","DVR (VHF) Crossband/No Inband; For APX (VHF+800) using Unknown or User-Defined Antenna",1,9,3,2,437,0,2,"No Drawing",""]
[null,"X",null,null,null,"X",null,null,null,"VHF","X",null,null,"X","SINGLE","IB+XB","DVR (VHF) Inband & Crossband; For APX (VHF+800) using Single-Band Antenna(s)",1,9,5,0,441,8,2,"No Drawing",""]
[null,null,null,"QA09448AA",null,"X",null,null,null,"VHF","X",null,null,"X","ALL","IB+XB","DVR (VHF) Inband & Crossband; For APX (VHF+800) using One All-Band Antenna",1,9,5,1,442,6,2,"8J087X51-26",""]
[null,null,null,"QA09448AA",null,"X",null,null,null,"VHF","X",null,null,"X","USER","IB+XB","DVR (VHF) Inband & Crossband; For APX (VHF+800) using Unknown or User-Defined Antenna",1,9,5,2,443,6,2,"No Drawing",""]
[null,"X",null,null,null,null,null,null,null,"VHF",null,"X",null,"X","SINGLE","XB-Forced","DVR (VHF) Crossband; For APX (UHF+800) using Single-Band Antenna(s)",1,10,4,0,455,2,2,"No Drawing",""]
[null,null,null,"QA09447AA",null,null,null,null,null,"VHF",null,"X",null,"X","ALL","XB-Forced","DVR (VHF) Crossband; For APX (UHF+800) using One All-Band Antenna",1,10,4,1,456,0,2,"8J087X51-16",""]
[null,null,null,"QA09447AA",null,null,null,null,null,"VHF",null,"X",null,"X","USER","XB-Forced","DVR (VHF) Crossband; For APX (UHF+800) using Unknown or User-Defined Antenna",1,10,4,2,457,0,2,"No Drawing",""]
[null,"X",null,null,null,"X",null,null,null,"VHF","X","X",null,"X","SINGLE","IB-Only","DVR (VHF) Inband/No Crossband; For APX (VHF+UHF+800) using Single-Band Antenna(s)",1,11,1,0,463,8,3,"No Drawing",""]
[null,null,null,null,null,"X",null,null,null,"VHF","X","X",null,"X","ALL","IB-Only","DVR (VHF) Inband/No Crossband; For APX (VHF+UHF+800) using One All-Band Antenna",1,11,1,1,464,6,3,"No Drawing",""]
[null,null,null,null,null,"X",null,null,null,"VHF","X","X",null,"X","USER","IB-Only","DVR (VHF) Inband/No Crossband; For APX (VHF+UHF+800) using Unknown or User-Defined Antenna",1,11,1,2,465,6,3,"No Drawing",""]
[null,"X",null,null,null,null,null,"QA09446AA",null,"VHF","X","X",null,"X","SINGLE","XB-Only","DVR (VHF) Crossband/No Inband; For APX (VHF+UHF+800) using Single-Band Antenna(s)",1,11,3,0,469,2,3,"8J087X51-55",""]
[null,null,null,null,"QA09487AA",null,null,null,null,"VHF","X","X",null,"X","ALL","XB-Only","DVR (VHF) Crossband/No Inband; For APX (VHF+UHF+800) using One All-Band Antenna",1,11,3,1,470,0,3,"8J087X51-37",""]
[null,null,null,null,"QA09487AA",null,null,null,null,"VHF","X","X",null,"X","USER","XB-Only","DVR (VHF) Crossband/No Inband; For APX (VHF+UHF+800) using Unknown or User-Defined Antenna",1,11,3,2,471,0,3,"No Drawing",""]
[null,"X",null,null,null,"X",null,null,null,"VHF","X","X",null,"X","SINGLE","IB+XB","DVR (VHF) Inband & Crossband; For APX (VHF+UHF+800) using Single-Band Antenna(s)",1,11,5,0,475,8,3,"No Drawing",""]
[null,null,null,"QA09448AA",null,"X",null,null,null,"VHF","X","X",null,"X","ALL","IB+XB",{"$f":"$J$6&\"(\"&$J71&\")\"&\" \"&VLOOKUP($P71,RPTCodes,2,FALSE) &\"; For APX (\"&VLOOKUP($S71,BAND_NAMES,2)&\") using \"&VLOOKUP($O71,ANTcodes,3,FALSE)","v":"DVR (VHF) Inband & Crossband; For APX (VHF+UHF+800) using One All-Band Antenna"},{"$f":"VLOOKUP(J71,Freq_Bands,2)","v":1},{"$f":"IF(K71=\"X\",1,0)+IF(L71=\"X\",2,0)+IF(M71=\"X\",4,0)+IF(N71=\"X\",8,0)","v":11},{"$f":"VLOOKUP(P71,RPTCodes,4,FALSE)","v":5},{"$f":"VLOOKUP(O71,ANTcodes,2,FALSE)","v":1},{"$f":"$U71*MULT_ANT+$T71*MULT_RPT+$S71*MULT_MRF+$R71*MULT_VRF","v":476},{"$f":"IF($A71=\"X\",1,0)+IF($B71=\"X\",2,0)+IF($C71=\"X\",3,0)+IF($D71=\"X\",4,0)+IF($E71=\"X\",5,0)+IF($F71=\"X\",6,0)+IF($H71=\"X\",10,0)","v":6},{"$f":"COUNTA(K71:L71)+IF(RIGHT(M71&N71,1)=\"X\",1,0)","v":3},"8J087X51-34",{"$f":"IF(COUNTIF($A71:$H71, \"<>\"&\"\")=0,\"INVALID COMBO\",\"\")","v":""}]
[null,null,null,"QA09448AA",null,"X",null,null,null,"VHF","X","X",null,"X","USER","IB+XB","DVR (VHF) Inband & Crossband; For APX (VHF+UHF+800) using Unknown or User-Defined Antenna",1,11,5,2,477,6,3,"No Drawing",""]
[null,"X",null,null,null,null,null,null,null,"VHF",null,null,"X","X","SINGLE","XB-Forced","DVR (VHF) Crossband; For APX (700+800) using Single-Band Antenna(s)",1,12,4,0,489,2,1,"No Drawing",""]
[null,"X",null,null,null,null,null,null,null,"VHF",null,null,"X","X","ALL","XB-Forced","DVR (VHF) Crossband; For APX (700+800) using One All-Band Antenna",1,12,4,1,490,2,1,"No Drawing",""]
[null,"X",null,null,null,null,null,null,null,"VHF",null,null,"X","X","USER","XB-Forced","DVR (VHF) Crossband; For APX (700+800) using Unknown or User-Defined Antenna",1,12,4,2,491,2,1,"No Drawing",""]
[null,"X",null,null,null,"X",null,null,null,"VHF","X",null,"X","X","SINGLE","IB-Only","DVR (VHF) Inband/No Crossband; For APX (VHF+700+800) using Single-Band Antenna(s)",1,13,1,0,497,8,2,"No Drawing",""]
[null,null,null,null,null,"X",null,null,null,"VHF","X",null,"X","X","ALL","IB-Only","DVR (VHF) Inband/No Crossband; For APX (VHF+700+800) using One All-Band Antenna",1,13,1,1,498,6,2,"No Drawing",""]
[null,null,null,null,null,"X",null,null,null,"VHF","X",null,"X","X","USER","IB-Only","DVR (VHF) Inband/No Crossband; For APX (VHF+700+800) using Unknown or User-Defined Antenna",1,13,1,2,499,6,2,"No Drawing",""]
[null,"X",null,null,null,null,null,"QA09446AA",null,"VHF","X",null,"X","X","SINGLE","XB-Only","DVR (VHF) Crossband/No Inband; For APX (VHF+700+800) using Single-Band Antenna(s)",1,13,3,0,503,2,2,"8J087X51-44",""]
[null,null,"QA09482AA",null,null,null,null,null,null,"VHF","X",null,"X","X","ALL","XB-Only","DVR (VHF) Crossband/No Inband; For APX (VHF+700+800) using One All-Band Antenna",1,13,3,1,504,0,2,"8J087X51-02",""]
[null,null,"QA09482AA",null,null,null,null,null,null,"VHF","X",null,"X","X","USER","XB-Only","DVR (VHF) Crossband/No Inband; For APX (VHF+700+800) using Unknown or User-Defined Antenna",1,13,3,2,505,0,2,"No Drawing",""]
[null,"X",null,null,null,"X",null,null,null,"VHF","X",null,"X","X","SINGLE","IB+XB","DVR (VHF) Inband & Crossband; For APX (VHF+700+800) using Single-Band Antenna(s)",1,13,5,0,509,8,2,"No Drawing",""]
[null,null,null,"QA09448AA",null,"X",null,null,null,"VHF","X",null,"X","X","ALL","IB+XB","DVR (VHF) Inband & Crossband; For APX (VHF+700+800) using One All-Band Antenna",1,13,5,1,510,6,2,"8J087X51-26",""]
[null,null,null,"QA09448AA",null,"X",null,null,null,"VHF","X",null,"X","X","USER","IB+XB","DVR (VHF) Inband & Crossband; For APX (VHF+700+800) using Unknown or User-Defined Antenna",1,13,5,2,511,6,2,"No Drawing",""]
[null,"X",null,null,null,null,null,null,null,"VHF",null,"X","X","X","SINGLE","XB-Forced","DVR (VHF) Crossband; For APX (UHF+700+800) using Single-Band Antenna(s)",1,14,4,0,523,2,2,"No Drawing",""]
[null,null,null,"QA09447AA",null,null,null,null,null,"VHF",null,"X","X","X","ALL","XB-Forced","DVR (VHF) Crossband; For APX (UHF+700+800) using One All-Band Antenna",1,14,4,1,524,0,2,"8J087X51-16",""]
[null,null,null,"QA09447AA",null,null,null,null,null,"VHF",null,"X","X","X","USER","XB-Forced","DVR (VHF) Crossband; For APX (UHF+700+800) using Unknown or User-Defined Antenna",1,14,4,2,525,0,2,"No Drawing",""]
[null,"X",null,null,null,"X",null,null,null,"VHF","X","X","X","X","SINGLE","IB-Only","DVR (VHF) Inband/No Crossband; For APX (VHF+UHF+700+800) using Single-Band Antenna(s)",1,15,1,0,531,8,3,"No Drawing",""]
[null,null,null,null,null,"X",null,null,null,"VHF","X","X","X","X","ALL","IB-Only","DVR (VHF) Inband/No Crossband; For APX (VHF+UHF+700+800) using One All-Band Antenna",1,15,1,1,532,6,3,"No Drawing",""]
[null,null,null,null,null,"X",null,null,null,"VHF","X","X","X","X","USER","IB-Only","DVR (VHF) Inband/No Crossband; For APX (VHF+UHF+700+800) using Unknown or User-Defined Antenna",1,15,1,2,533,6,3,"No Drawing",""]
[null,"X",null,null,null,null,null,"QA09446AA",null,"VHF","X","X","X","X","SINGLE","XB-Only","DVR (VHF) Crossband/No Inband; For APX (VHF+UHF+700+800) using Single-Band Antenna(s)",1,15,3,0,537,2,3,"8J087X51-55",""]
[null,null,null,null,"QA09487AA",null,null,null,null,"VHF","X","X","X","X","ALL","XB-Only","DVR (VHF) Crossband/No Inband; For APX (VHF+UHF+700+800) using One All-Band Antenna",1,15,3,1,538,0,3,"8J087X51-37",""]
[null,null,null,null,"QA09487AA",null,null,null,null,"VHF","X","X","X","X","USER","XB-Only","DVR (VHF) Crossband/No Inband; For APX (VHF+UHF+700+800) using Unknown or User-Defined Antenna",1,15,3,2,539,0,3,"No Drawing",""]
[null,"X",null,null,null,"X",null,null,null,"VHF","X","X","X","X","SINGLE","IB+XB","DVR (VHF) Inband & Crossband; For APX (VHF+UHF+700+800) using Single-Band Antenna(s)",1,15,5,0,543,8,3,"No Drawing",""]
[null,null,null,"QA09448AA",null,"X",null,null,null,"VHF","X","X","X","X","ALL","IB+XB","DVR (VHF) Inband & Crossband; For APX (VHF+UHF+700+800) using One All-Band Antenna",1,15,5,1,544,6,3,"8J087X51-34",""]
[null,null,null,"QA09448AA",null,"X",null,null,null,"VHF","X","X","X","X","USER","IB+XB","DVR (VHF) Inband & Crossband; For APX (VHF+UHF+700+800) using Unknown or User-Defined Antenna",1,15,5,2,545,6,3,"No Drawing",""]
[null,"X",null,null,null,null,null,null,null,"UHF","X",null,null,null,"SINGLE","XB-Forced","DVR (UHF) Crossband; For APX (VHF) using Single-Band Antenna(s)",2,1,4,0,575,2,1,"No Drawing",""]
[null,"X",null,null,null,null,null,null,null,"UHF","X",null,null,null,"ALL","XB-Forced","DVR (UHF) Crossband; For APX (VHF) using One All-Band Antenna",2,1,4,1,576,2,1,"No Drawing",""]
[null,"X",null,null,null,null,null,null,null,"UHF","X",null,null,null,"USER","XB-Forced","DVR (UHF) Crossband; For APX (VHF) using Unknown or User-Defined Antenna",2,1,4,2,577,2,1,"No Drawing",""]
["X",null,null,null,null,"X",null,null,null,"UHF",null,"X",null,null,"SINGLE","IB-Forced","DVR (UHF) Inband; For APX (UHF) using Single-Band Antenna(s)",2,2,2,0,586,7,1,"No Drawing",""]
["X",null,null,null,null,"X",null,null,null,"UHF",null,"X",null,null,"ALL","IB-Forced","DVR (UHF) Inband; For APX (UHF) using One All-Band Antenna",2,2,2,1,587,7,1,"No Drawing",""]
["X",null,null,null,null,"X",null,null,null,"UHF",null,"X",null,null,"USER","IB-Forced","DVR (UHF) Inband; For APX (UHF) using Unknown or User-Defined Antenna",2,2,2,2,588,7,1,"No Drawing",""]
[null,null,null,null,null,null,null,null,"INVALID COMBO","UHF",null,"X",null,null,"SINGLE","XB-Only","DVR (UHF) Crossband/No Inband; For APX (UHF) using Single-Band Antenna(s)",2,2,3,0,589,0,1,"No Drawing","INVALID COMBO"]
[null,null,null,null,null,null,null,null,"INVALID COMBO","UHF",null,"X",null,null,"ALL","XB-Only","DVR (UHF) Crossband/No Inband; For APX (UHF) using One All-Band Antenna",2,2,3,1,590,0,1,"No Drawing","INVALID COMBO"]
[null,null,null,null,null,null,null,null,"INVALID COMBO","UHF",null,"X",null,null,"USER","XB-Only","DVR (UHF) Crossband/No Inband; For APX (UHF) using Unknown or User-Defined Antenna",2,2,3,2,591,0,1,"No Drawing","INVALID COMBO"]
[null,"X",null,null,null,"X",null,null,null,"UHF","X","X",null,null,"SINGLE","IB-Only","DVR (UHF) Inband/No Crossband; For APX (VHF+UHF) using Single-Band Antenna(s)",2,3,1,0,600,8,2,"No Drawing",""]
[null,null,null,null,null,"X",null,null,null,"UHF","X","X",null,null,"ALL","IB-Only","DVR (UHF) Inband/No Crossband; For APX (VHF+UHF) using One All-Band Antenna",2,3,1,1,601,6,2,"No Drawing",""]
[null,null,null,null,null,"X",null,null,null,"UHF","X","X",null,null,"USER","IB-Only","DVR (UHF) Inband/No Crossband; For APX (VHF+UHF) using Unknown or User-Defined Antenna",2,3,1,2,602,6,2,"No Drawing",""]
[null,"X",null,null,null,null,null,"QA09446AA",null,"UHF","X","X",null,null,"SINGLE","XB-Only","DVR (UHF) Crossband/No Inband; For APX (VHF+UHF) using Single-Band Antenna(s)",2,3,3,0,606,2,2,"8J087X51-45",""]
[null,null,"QA09483AA",null,null,null,null,null,null,"UHF","X","X",null,null,"ALL","XB-Only","DVR (UHF) Crossband/No Inband; For APX (VHF+UHF) using One All-Band Antenna",2,3,3,1,607,0,2,"8J087X51-03",""]
[null,null,"QA09483AA",null,null,null,null,null,null,"UHF","X","X",null,null,"USER","XB-Only","DVR (UHF) Crossband/No Inband; For APX (VHF+UHF) using Unknown or User-Defined Antenna",2,3,3,2,608,0,2,"No Drawing",""]
[null,"X",null,null,null,"X",null,null,null,"UHF","X","X",null,null,"SINGLE","IB+XB","DVR (UHF) Inband & Crossband; For APX (VHF+UHF) using Single-Band Antenna(s)",2,3,5,0,612,8,2,"No Drawing",""]
[null,null,null,"QA09448AA",null,"X",null,null,null,"UHF","X","X",null,null,"ALL","IB+XB","DVR (UHF) Inband & Crossband; For APX (VHF+UHF) using One All-Band Antenna",2,3,5,1,613,6,2,"8J087X51-27",""]
[null,null,null,"QA09448AA",null,"X",null,null,null,"UHF","X","X",null,null,"USER","IB+XB","DVR (UHF) Inband & Crossband; For APX (VHF+UHF) using Unknown or User-Defined Antenna",2,3,5,2,614,6,2,"No Drawing",""]
[null,"X",null,null,null,null,null,null,null,"UHF",null,null,"X",null,"SINGLE","XB-Forced","DVR (UHF) Crossband; For APX (700) using Single-Band Antenna(s)",2,4,4,0,626,2,1,"No Drawing",""]
[null,"X",null,null,null,null,null,null,null,"UHF",null,null,"X",null,"ALL","XB-Forced","DVR (UHF) Crossband; For APX (700) using One All-Band Antenna",2,4,4,1,627,2,1,"No Drawing",""]
[null,"X",null,null,null,null,null,null,null,"UHF",null,null,"X",null,"USER","XB-Forced","DVR (UHF) Crossband; For APX (700) using Unknown or User-Defined Antenna",2,4,4,2,628,2,1,"No Drawing",""]
[null,"X",null,null,null,null,null,null,null,"UHF","X",null,"X",null,"SINGLE","XB-Forced","DVR (UHF) Crossband; For APX (VHF+700) using Single-Band Antenna(s)",2,5,4,0,643,2,2,"No Drawing",""]
[null,null,null,"QA09447AA",null,null,null,null,null,"UHF","X",null,"X",null,"ALL","XB-Forced","DVR (UHF) Crossband; For APX (VHF+700) using One All-Band Antenna",2,5,4,1,644,0,2,"8J087X51-17",""]
[null,null,null,"QA09447AA",null,null,null,null,null,"UHF","X",null,"X",null,"USER","XB-Forced","DVR (UHF) Crossband; For APX (VHF+700) using Unknown or User-Defined Antenna",2,5,4,2,645,0,2,"No Drawing",""]
[null,"X",null,null,null,"X",null,null,null,"UHF",null,"X","X",null,"SINGLE","IB-Only","DVR (UHF) Inband/No Crossband; For APX (UHF+700) using Single-Band Antenna(s)",2,6,1,0,651,8,2,"No Drawing",""]
[null,null,null,null,null,"X",null,null,null,"UHF",null,"X","X",null,"ALL","IB-Only","DVR (UHF) Inband/No Crossband; For APX (UHF+700) using One All-Band Antenna",2,6,1,1,652,6,2,"No Drawing",""]
[null,null,null,null,null,"X",null,null,null,"UHF",null,"X","X",null,"USER","IB-Only","DVR (UHF) Inband/No Crossband; For APX (UHF+700) using Unknown or User-Defined Antenna",2,6,1,2,653,6,2,"No Drawing",""]
[null,"X",null,null,null,null,null,"QA09446AA",null,"UHF",null,"X","X",null,"SINGLE","XB-Only","DVR (UHF) Crossband/No Inband; For APX (UHF+700) using Single-Band Antenna(s)",2,6,3,0,657,2,2,"8J087X51-46",""]
[null,null,"QA09483AA",null,null,null,null,null,null,"UHF",null,"X","X",null,"ALL","XB-Only","DVR (UHF) Crossband/No Inband; For APX (UHF+700) using One All-Band Antenna",2,6,3,1,658,0,2,"8J087X51-04",""]
[null,null,"QA09483AA",null,null,null,null,null,null,"UHF",null,"X","X",null,"USER","XB-Only","DVR (UHF) Crossband/No Inband; For APX (UHF+700) using Unknown or User-Defined Antenna",2,6,3,2,659,0,2,"No Drawing",""]
[null,"X",null,null,null,"X",null,null,null,"UHF",null,"X","X",null,"SINGLE","IB+XB","DVR (UHF) Inband & Crossband; For APX (UHF+700) using Single-Band Antenna(s)",2,6,5,0,663,8,2,"No Drawing",""]
[null,null,null,"QA09448AA",null,"X",null,null,null,"UHF",null,"X","X",null,"ALL","IB+XB","DVR (UHF) Inband & Crossband; For APX (UHF+700) using One All-Band Antenna",2,6,5,1,664,6,2,"8J087X51-28",""]
[null,null,null,"QA09448AA",null,"X",null,null,null,"UHF",null,"X","X",null,"USER","IB+XB","DVR (UHF) Inband & Crossband; For APX (UHF+700) using Unknown or User-Defined Antenna",2,6,5,2,665,6,2,"No Drawing",""]
[null,"X",null,null,null,"X",null,null,null,"UHF","X","X","X",null,"SINGLE","IB-Only","DVR (UHF) Inband/No Crossband; For APX (VHF+UHF+700) using Single-Band Antenna(s)",2,7,1,0,668,8,3,"No Drawing",""]
[null,null,null,null,null,"X",null,null,null,"UHF","X","X","X",null,"ALL","IB-Only","DVR (UHF) Inband/No Crossband; For APX (VHF+UHF+700) using One All-Band Antenna",2,7,1,1,669,6,3,"No Drawing",""]
[null,null,null,null,null,"X",null,null,null,"UHF","X","X","X",null,"USER","IB-Only","DVR (UHF) Inband/No Crossband; For APX (VHF+UHF+700) using Unknown or User-Defined Antenna",2,7,1,2,670,6,3,"No Drawing",""]
[null,"X",null,null,null,null,null,"QA09446AA",null,"UHF","X","X","X",null,"SINGLE","XB-Only","DVR (UHF) Crossband/No Inband; For APX (VHF+UHF+700) using Single-Band Antenna(s)",2,7,3,0,674,2,3,"8J087X51-56",""]
[null,null,null,null,"QA09488AA",null,null,null,null,"UHF","X","X","X",null,"ALL","XB-Only","DVR (UHF) Crossband/No Inband; For APX (VHF+UHF+700) using One All-Band Antenna",2,7,3,1,675,0,3,"8J087X51-38",""]
[null,null,null,null,"QA09488AA",null,null,null,null,"UHF","X","X","X",null,"USER","XB-Only",{"$f":"$J$6&\"(\"&$J135&\")\"&\" \"&VLOOKUP($P135,RPTCodes,2,FALSE) &\"; For APX (\"&VLOOKUP($S135,BAND_NAMES,2)&\") using \"&VLOOKUP($O135,ANTcodes,3,FALSE)","v":"DVR (UHF) Crossband/No Inband; For APX (VHF+UHF+700) using Unknown or User-Defined Antenna"},{"$f":"VLOOKUP(J135,Freq_Bands,2)","v":2},{"$f":"IF(K135=\"X\",1,0)+IF(L135=\"X\",2,0)+IF(M135=\"X\",4,0)+IF(N135=\"X\",8,0)","v":7},{"$f":"VLOOKUP(P135,RPTCodes,4,FALSE)","v":3},{"$f":"VLOOKUP(O135,ANTcodes,2,FALSE)","v":2},{"$f":"$U135*MULT_ANT+$T135*MULT_RPT+$S135*MULT_MRF+$R135*MULT_VRF","v":676},{"$f":"IF($A135=\"X\",1,0)+IF($B135=\"X\",2,0)+IF($C135=\"X\",3,0)+IF($D135=\"X\",4,0)+IF($E135=\"X\",5,0)+IF($F135=\"X\",6,0)+IF($H135=\"X\",10,0)","v":0},{"$f":"COUNTA(K135:L135)+IF(RIGHT(M135&N135,1)=\"X\",1,0)","v":3},"No Drawing",{"$f":"IF(COUNTIF($A135:$H135, \"<>\"&\"\")=0,\"INVALID COMBO\",\"\")","v":""}]
[null,"X",null,null,null,"X",null,null,null,"UHF","X","X","X",null,"SINGLE","IB+XB","DVR (UHF) Inband & Crossband; For APX (VHF+UHF+700) using Single-Band Antenna(s)",2,7,5,0,680,8,3,"No Drawing",""]
[null,null,null,"QA09448AA",null,"X",null,null,null,"UHF","X","X","X",null,"ALL","IB+XB","DVR (UHF) Inband & Crossband; For APX (VHF+UHF+700) using One All-Band Antenna",2,7,5,1,681,6,3,"8J087X51-35",""]
[null,null,null,"QA09448AA",null,"X",null,null,null,"UHF","X","X","X",null,"USER","IB+XB","DVR (UHF) Inband & Crossband; For APX (VHF+UHF+700) using Unknown or User-Defined Antenna",2,7,5,2,682,6,3,"No Drawing",""]
[null,"X",null,null,null,null,null,null,null,"UHF",null,null,null,"X","SINGLE","XB-Forced","DVR (UHF) Crossband; For APX (800) using Single-Band Antenna(s)",2,8,4,0,694,2,1,"No Drawing",""]
[null,"X",null,null,null,null,null,null,null,"UHF",null,null,null,"X","ALL","XB-Forced","DVR (UHF) Crossband; For APX (800) using One All-Band Antenna",2,8,4,1,695,2,1,"No Drawing",""]
[null,"X",null,null,null,null,null,null,null,"UHF",null,null,null,"X","USER","XB-Forced","DVR (UHF) Crossband; For APX (800) using Unknown or User-Defined Antenna",2,8,4,2,696,2,1,"No Drawing",""]
[null,"X",null,null,null,null,null,null,null,"UHF","X",null,null,"X","SINGLE","XB-Forced","DVR (UHF) Crossband; For APX (VHF+800) using Single-Band Antenna(s)",2,9,4,0,711,2,2,"No Drawing",""]
[null,null,null,"QA09447AA",null,null,null,null,null,"UHF","X",null,null,"X","ALL","XB-Forced","DVR (UHF) Crossband; For APX (VHF+800) using One All-Band Antenna",2,9,4,1,712,0,2,"8J087X51-17",""]
[null,null,null,"QA09447AA",null,null,null,null,null,"UHF","X",null,null,"X","USER","XB-Forced","DVR (UHF) Crossband; For APX (VHF+800) using Unknown or User-Defined Antenna",2,9,4,2,713,0,2,"No Drawing",""]
[null,"X",null,null,null,"X",null,null,null,"UHF",null,"X",null,"X","SINGLE","IB-Only","DVR (UHF) Inband/No Crossband; For APX (UHF+800) using Single-Band Antenna(s)",2,10,1,0,719,8,2,"No Drawing",""]
[null,null,null,null,null,"X",null,null,null,"UHF",null,"X",null,"X","ALL","IB-Only","DVR (UHF) Inband/No Crossband; For APX (UHF+800) using One All-Band Antenna",2,10,1,1,720,6,2,"No Drawing",""]
[null,null,null,null,null,"X",null,null,null,"UHF",null,"X",null,"X","USER","IB-Only","DVR (UHF) Inband/No Crossband; For APX (UHF+800) using Unknown or User-Defined Antenna",2,10,1,2,721,6,2,"No Drawing",""]
[null,"X",null,null,null,null,null,"QA09446AA",null,"UHF",null,"X",null,"X","SINGLE","XB-Only","DVR (UHF) Crossband/No Inband; For APX (UHF+800) using Single-Band Antenna(s)",2,10,3,0,725,2,2,"8J087X51-46",""]
[null,null,"QA09483AA",null,null,null,null,null,null,"UHF",null,"X",null,"X","ALL","XB-Only","DVR (UHF) Crossband/No Inband; For APX (UHF+800) using One All-Band Antenna",2,10,3,1,726,0,2,"8J087X51-04",""]
[null,null,"QA09483AA",null,null,null,null,null,null,"UHF",null,"X",null,"X","USER","XB-Only","DVR (UHF) Crossband/No Inband; For APX (UHF+800) using Unknown or User-Defined Antenna",2,10,3,2,727,0,2,"No Drawing",""]
[null,"X",null,null,null,"X",null,null,null,"UHF",null,"X",null,"X","SINGLE","IB+XB","DVR (UHF) Inband & Crossband; For APX (UHF+800) using Single-Band Antenna(s)",2,10,5,0,731,8,2,"No Drawing",""]
[null,null,null,"QA09448AA",null,"X",null,null,null,"UHF",null,"X",null,"X","ALL","IB+XB","DVR (UHF) Inband & Crossband; For APX (UHF+800) using One All-Band Antenna",2,10,5,1,732,6,2,"8J087X51-28",""]
[null,null,null,"QA09448AA",null,"X",null,null,null,"UHF",null,"X",null,"X","USER","IB+XB","DVR (UHF) Inband & Crossband; For APX (UHF+800) using Unknown or User-Defined Antenna",2,10,5,2,733,6,2,"No Drawing",""]
[null,"X",null,null,null,"X",null,null,null,"UHF","X","X",null,"X","SINGLE","IB-Only","DVR (UHF) Inband/No Crossband; For APX (VHF+UHF+800) using Single-Band Antenna(s)",2,11,1,0,736,8,3,"No Drawing",""]
[null,null,null,null,null,"X",null,null,null,"UHF","X","X",null,"X","ALL","IB-Only","DVR (UHF) Inband/No Crossband; For APX (VHF+UHF+800) using One All-Band Antenna",2,11,1,1,737,6,3,"No Drawing",""]
[null,null,null,null,null,"X",null,null,null,"UHF","X","X",null,"X","USER","IB-Only","DVR (UHF) Inband/No Crossband; For APX (VHF+UHF+800) using Unknown or User-Defined Antenna",2,11,1,2,738,6,3,"No Drawing",""]
[null,"X",null,null,null,null,null,"QA09446AA",null,"UHF","X","X",null,"X","SINGLE","XB-Only","DVR (UHF) Crossband/No Inband; For APX (VHF+UHF+800) using Single-Band Antenna(s)",2,11,3,0,742,2,3,"8J087X51-56",""]
[null,null,null,null,"QA09488AA",null,null,null,null,"UHF","X","X",null,"X","ALL","XB-Only","DVR (UHF) Crossband/No Inband; For APX (VHF+UHF+800) using One All-Band Antenna",2,11,3,1,743,0,3,"8J087X51-38",""]
[null,null,null,null,"QA09488AA",null,null,null,null,"UHF","X","X",null,"X","USER","XB-Only","DVR (UHF) Crossband/No Inband; For APX (VHF+UHF+800) using Unknown or User-Defined Antenna",2,11,3,2,744,0,3,"No Drawing",""]
[null,"X",null,null,null,"X",null,null,null,"UHF","X","X",null,"X","SINGLE","IB+XB","DVR (UHF) Inband & Crossband; For APX (VHF+UHF+800) using Single-Band Antenna(s)",2,11,5,0,748,8,3,"No Drawing",""]
[null,null,null,"QA09448AA",null,"X",null,null,null,"UHF","X","X",null,"X","ALL","IB+XB","DVR (UHF) Inband & Crossband; For APX (VHF+UHF+800) using One All-Band Antenna",2,11,5,1,749,6,3,"8J087X51-35",""]
[null,null,null,"QA09448AA",null,"X",null,null,null,"UHF","X","X",null,"X","USER","IB+XB","DVR (UHF) Inband & Crossband; For APX (VHF+UHF+800) using Unknown or User-Defined Antenna",2,11,5,2,750,6,3,"No Drawing",""]
[null,"X",null,null,null,null,null,null,null,"UHF",null,null,"X","X","SINGLE","XB-Forced","DVR (UHF) Crossband; For APX (700+800) using Single-Band Antenna(s)",2,12,4,0,762,2,1,"No Drawing",""]
[null,"X",null,null,null,null,null,null,null,"UHF",null,null,"X","X","ALL","XB-Forced","DVR (UHF) Crossband; For APX (700+800) using One All-Band Antenna",2,12,4,1,763,2,1,"No Drawing",""]
[null,"X",null,null,null,null,null,null,null,"UHF",null,null,"X","X","USER","XB-Forced","DVR (UHF) Crossband; For APX (700+800) using Unknown or User-Defined Antenna",2,12,4,2,764,2,1,"No Drawing",""]
[null,"X",null,null,null,null,null,null,null,"UHF","X",null,"X","X","SINGLE","XB-Forced","DVR (UHF) Crossband; For APX (VHF+700+800) using Single-Band Antenna(s)",2,13,4,0,779,2,2,"No Drawing",""]
[null,null,null,"QA09447AA",null,null,null,null,null,"UHF","X",null,"X","X","ALL","XB-Forced","DVR (UHF) Crossband; For APX (VHF+700+800) using One All-Band Antenna",2,13,4,1,780,0,2,"8J087X51-17",""]
[null,null,null,"QA09447AA",null,null,null,null,null,"UHF","X",null,"X","X","USER","XB-Forced","DVR (UHF) Crossband; For APX (VHF+700+800) using Unknown or User-Defined Antenna",2,13,4,2,781,0,2,"No Drawing",""]
[null,"X",null,null,null,"X",null,null,null,"UHF",null,"X","X","X","SINGLE","IB-Only","DVR (UHF) Inband/No Crossband; For APX (UHF+700+800) using Single-Band Antenna(s)",2,14,1,0,787,8,2,"No Drawing",""]
[null,null,null,null,null,"X",null,null,null,"UHF",null,"X","X","X","ALL","IB-Only","DVR (UHF) Inband/No Crossband; For APX (UHF+700+800) using One All-Band Antenna",2,14,1,1,788,6,2,"No Drawing",""]
[null,null,null,null,null,"X",null,null,null,"UHF",null,"X","X","X","USER","IB-Only","DVR (UHF) Inband/No Crossband; For APX (UHF+700+800) using Unknown or User-Defined Antenna",2,14,1,2,789,6,2,"No Drawing",""]
[null,"X",null,null,null,null,null,"QA09446AA",null,"UHF",null,"X","X","X","SINGLE","XB-Only","DVR (UHF) Crossband/No Inband; For APX (UHF+700+800) using Single-Band Antenna(s)",2,14,3,0,793,2,2,"8J087X51-46",""]
[null,null,"QA09483AA",null,null,null,null,null,null,"UHF",null,"X","X","X","ALL","XB-Only","DVR (UHF) Crossband/No Inband; For APX (UHF+700+800) using One All-Band Antenna",2,14,3,1,794,0,2,"8J087X51-04",""]
[null,null,"QA09483AA",null,null,null,null,null,null,"UHF",null,"X","X","X","USER","XB-Only","DVR (UHF) Crossband/No Inband; For APX (UHF+700+800) using Unknown or User-Defined Antenna",2,14,3,2,795,0,2,"No Drawing",""]
[null,"X",null,null,null,"X",null,null,null,"UHF",null,"X","X","X","SINGLE","IB+XB","DVR (UHF) Inband & Crossband; For APX (UHF+700+800) using Single-Band Antenna(s)",2,14,5,0,799,8,2,"No Drawing",""]
[null,null,null,"QA09448AA",null,"X",null,null,null,"UHF",null,"X","X","X","ALL","IB+XB","DVR (UHF) Inband & Crossband; For APX (UHF+700+800) using One All-Band Antenna",2,14,5,1,800,6,2,"8J087X51-28",""]
[null,null,null,"QA09448AA",null,"X",null,null,null,"UHF",null,"X","X","X","USER","IB+XB","DVR (UHF) Inband & Crossband; For APX (UHF+700+800) using Unknown or User-Defined Antenna",2,14,5,2,801,6,2,"No Drawing",""]
[null,"X",null,null,null,"X",null,null,null,"UHF","X","X","X","X","SINGLE","IB-Only","DVR (UHF) Inband/No Crossband; For APX (VHF+UHF+700+800) using Single-Band Antenna(s)",2,15,1,0,804,8,3,"No Drawing",""]
[null,null,null,null,null,"X",null,null,null,"UHF","X","X","X","X","ALL","IB-Only","DVR (UHF) Inband/No Crossband; For APX (VHF+UHF+700+800) using One All-Band Antenna",2,15,1,1,805,6,3,"No Drawing",""]
[null,null,null,null,null,"X",null,null,null,"UHF","X","X","X","X","USER","IB-Only","DVR (UHF) Inband/No Crossband; For APX (VHF+UHF+700+800) using Unknown or User-Defined Antenna",2,15,1,2,806,6,3,"No Drawing",""]
[null,"X",null,null,null,null,null,"QA09446AA",null,"UHF","X","X","X","X","SINGLE","XB-Only","DVR (UHF) Crossband/No Inband; For APX (VHF+UHF+700+800) using Single-Band Antenna(s)",2,15,3,0,810,2,3,"8J087X51-56",""]
[null,null,null,null,"QA09488AA",null,null,null,null,"UHF","X","X","X","X","ALL","XB-Only","DVR (UHF) Crossband/No Inband; For APX (VHF+UHF+700+800) using One All-Band Antenna",2,15,3,1,811,0,3,"8J087X51-38",""]
[null,null,null,null,"QA09488AA",null,null,null,null,"UHF","X","X","X","X","USER","XB-Only","DVR (UHF) Crossband/No Inband; For APX (VHF+UHF+700+800) using Unknown or User-Defined Antenna",2,15,3,2,812,0,3,"No Drawing",""]
[null,"X",null,null,null,"X",null,null,null,"UHF","X","X","X","X","SINGLE","IB+XB","DVR (UHF) Inband & Crossband; For APX (VHF+UHF+700+800) using Single-Band Antenna(s)",2,15,5,0,816,8,3,"No Drawing",""]
[null,null,null,"QA09448AA",null,"X",null,null,null,"UHF","X","X","X","X","ALL","IB+XB","DVR (UHF) Inband & Crossband; For APX (VHF+UHF+700+800) using One All-Band Antenna",2,15,5,1,817,6,3,"8J087X51-35",""]
[null,null,null,"QA09448AA",null,"X",null,null,null,"UHF","X","X","X","X","USER","IB+XB","DVR (UHF) Inband & Crossband; For APX (VHF+UHF+700+800) using Unknown or User-Defined Antenna",2,15,5,2,818,6,3,"No Drawing",""]
[null,"X",null,null,null,null,null,null,null,700,"X",null,null,null,"SINGLE","XB-Forced","DVR (700) Crossband; For APX (VHF) using Single-Band Antenna(s)",3,1,4,0,848,2,1,"No Drawing",""]
[null,"X",null,null,null,null,null,null,null,700,"X",null,null,null,"ALL","XB-Forced","DVR (700) Crossband; For APX (VHF) using One All-Band Antenna",3,1,4,1,849,2,1,"No Drawing",""]
[null,"X",null,null,null,null,null,null,null,700,"X",null,null,null,"USER","XB-Forced","DVR (700) Crossband; For APX (VHF) using Unknown or User-Defined Antenna",3,1,4,2,850,2,1,"No Drawing",""]
[null,"X",null,null,null,null,null,null,null,700,null,"X",null,null,"SINGLE","XB-Forced","DVR (700) Crossband; For APX (UHF) using Single-Band Antenna(s)",3,2,4,0,865,2,1,"No Drawing",""]
[null,"X",null,null,null,null,null,null,null,700,null,"X",null,null,"ALL","XB-Forced","DVR (700) Crossband; For APX (UHF) using One All-Band Antenna",3,2,4,1,866,2,1,"No Drawing",""]
[null,"X",null,null,null,null,null,null,null,700,null,"X",null,null,"USER","XB-Forced","DVR (700) Crossband; For APX (UHF) using Unknown or User-Defined Antenna",3,2,4,2,867,2,1,"No Drawing",""]
[null,"X",null,null,null,null,null,null,null,700,"X","X",null,null,"SINGLE","XB-Forced","DVR (700) Crossband; For APX (VHF+UHF) using Single-Band Antenna(s)",3,3,4,0,882,2,2,"No Drawing",""]
[null,null,null,"QA09447AA",null,null,null,null,null,700,"X","X",null,null,"ALL","XB-Forced","DVR (700) Crossband; For APX (VHF+UHF) using One All-Band Antenna",3,3,4,1,883,0,2,"8J087X51-18",""]
[null,null,null,"QA09447AA",null,null,null,null,null,700,"X","X",null,null,"USER","XB-Forced","DVR (700) Crossband; For APX (VHF+UHF) using Unknown or User-Defined Antenna",3,3,4,2,884,0,2,"No Drawing",""]
["X",null,null,null,null,"X",null,null,null,700,null,null,"X",null,"SINGLE","IB-Forced","DVR (700) Inband; For APX (700) using Single-Band Antenna(s)",3,4,2,0,893,7,1,"No Drawing",""]
["X",null,null,null,null,"X",null,null,null,700,null,null,"X",null,"ALL","IB-Forced","DVR (700) Inband; For APX (700) using One All-Band Antenna",3,4,2,1,894,7,1,"No Drawing",""]
["X",null,null,null,null,"X",null,null,null,700,null,null,"X",null,"USER","IB-Forced","DVR (700) Inband; For APX (700) using Unknown or User-Defined Antenna",3,4,2,2,895,7,1,"No Drawing",""]
[" ",null,null,null,null,null,null,null,"INVALID COMBO",700,null,null,"X",null,"SINGLE","XB-Only",{"$f":"$J$6&\"(\"&$J199&\")\"&\" \"&VLOOKUP($P199,RPTCodes,2,FALSE) &\"; For APX (\"&VLOOKUP($S199,BAND_NAMES,2)&\") using \"&VLOOKUP($O199,ANTcodes,3,FALSE)","v":"DVR (700) Crossband/No Inband; For APX (700) using Single-Band Antenna(s)"},{"$f":"VLOOKUP(J199,Freq_Bands,2)","v":3},{"$f":"IF(K199=\"X\",1,0)+IF(L199=\"X\",2,0)+IF(M199=\"X\",4,0)+IF(N199=\"X\",8,0)","v":4},{"$f":"VLOOKUP(P199,RPTCodes,4,FALSE)","v":3},{"$f":"VLOOKUP(O199,ANTcodes,2,FALSE)","v":0},{"$f":"$U199*MULT_ANT+$T199*MULT_RPT+$S199*MULT_MRF+$R199*MULT_VRF","v":896},{"$f":"IF($A199=\"X\",1,0)+IF($B199=\"X\",2,0)+IF($C199=\"X\",3,0)+IF($D199=\"X\",4,0)+IF($E199=\"X\",5,0)+IF($F199=\"X\",6,0)+IF($H199=\"X\",10,0)","v":0},{"$f":"COUNTA(K199:L199)+IF(RIGHT(M199&N199,1)=\"X\",1,0)","v":1},"No Drawing",{"$f":"IF(COUNTIF($A199:$H199, \"<>\"&\"\")=0,\"INVALID COMBO\",\"\")","v":""}]
[null,null,null,null,null,null,null,null,"INVALID COMBO",700,null,null,"X",null,"ALL","XB-Only","DVR (700) Crossband/No Inband; For APX (700) using One All-Band Antenna",3,4,3,1,897,0,1,"No Drawing","INVALID COMBO"]
[" ",null,null,null,null,null,null,null,"INVALID COMBO",700,null,null,"X",null,"USER","XB-Only","DVR (700) Crossband/No Inband; For APX (700) using Unknown or User-Defined Antenna",3,4,3,2,898,0,1,"No Drawing",""]
[null,"X",null,null,null,"X",null,null,null,700,"X",null,"X",null,"SINGLE","IB-Only","DVR (700) Inband/No Crossband; For APX (VHF+700) using Single-Band Antenna(s)",3,5,1,0,907,8,2,"No Drawing",""]
[null,null,null,null,null,"X",null,null,null,700,"X",null,"X",null,"ALL","IB-Only","DVR (700) Inband/No Crossband; For APX (VHF+700) using One All-Band Antenna",3,5,1,1,908,6,2,"No Drawing",""]
[null,null,null,null,null,"X",null,null,null,700,"X",null,"X",null,"USER","IB-Only","DVR (700) Inband/No Crossband; For APX (VHF+700) using Unknown or User-Defined Antenna",3,5,1,2,909,6,2,"No Drawing",""]
[null,"X",null,null,null,null,null,"QA09446AA",null,700,"X",null,"X",null,"SINGLE","XB-Only","DVR (700) Crossband/No Inband; For APX (VHF+700) using Single-Band Antenna(s)",3,5,3,0,913,2,2,"8J087X51-47",""]
[null,null,"QA09449AA",null,null,null,null,null,null,700,"X",null,"X",null,"ALL","XB-Only","DVR (700) Crossband/No Inband; For APX (VHF+700) using One All-Band Antenna",3,5,3,1,914,0,2,"8J087X51-05",""]
[null,null,"QA09449AA",null,null,null,null,null,null,700,"X",null,"X",null,"USER","XB-Only","DVR (700) Crossband/No Inband; For APX (VHF+700) using Unknown or User-Defined Antenna",3,5,3,2,915,0,2,"No Drawing",""]
[null,"X",null,null,null,"X",null,null,null,700,"X",null,"X",null,"SINGLE","IB+XB","DVR (700) Inband & Crossband; For APX (VHF+700) using Single-Band Antenna(s)",3,5,5,0,919,8,2,"No Drawing",""]
[null,null,null,"QA09448AA",null,"X",null,null,null,700,"X",null,"X",null,"ALL","IB+XB","DVR (700) Inband & Crossband; For APX (VHF+700) using One All-Band Antenna",3,5,5,1,920,6,2,"8J087X51-29",""]
[null,null,null,"QA09448AA",null,"X",null,null,null,700,"X",null,"X",null,"USER","IB+XB","DVR (700) Inband & Crossband; For APX (VHF+700) using Unknown or User-Defined Antenna",3,5,5,2,921,6,2,"No Drawing",""]
[null,"X",null,null,null,"X",null,null,null,700,null,"X","X",null,"SINGLE","IB-Only","DVR (700) Inband/No Crossband; For APX (UHF+700) using Single-Band Antenna(s)",3,6,1,0,924,8,2,"No Drawing",""]
[null,null,null,null,null,"X",null,null,null,700,null,"X","X",null,"ALL","IB-Only","DVR (700) Inband/No Crossband; For APX (UHF+700) using One All-Band Antenna",3,6,1,1,925,6,2,"No Drawing",""]
[null,null,null,null,null,"X",null,null,null,700,null,"X","X",null,"USER","IB-Only","DVR (700) Inband/No Crossband; For APX (UHF+700) using Unknown or User-Defined Antenna",3,6,1,2,926,6,2,"No Drawing",""]
[null,"X",null,null,null,null,null,"QA09446AA",null,700,null,"X","X",null,"SINGLE","XB-Only","DVR (700) Crossband/No Inband; For APX (UHF+700) using Single-Band Antenna(s)",3,6,3,0,930,2,2,"8J087X51-48",""]
[null,null,"QA09449AA",null,null,null,null,null,null,700,null,"X","X",null,"ALL","XB-Only","DVR (700) Crossband/No Inband; For APX (UHF+700) using One All-Band Antenna",3,6,3,1,931,0,2,"8J087X51-06",""]
[null,null,"QA09449AA",null,null,null,null,null,null,700,null,"X","X",null,"USER","XB-Only","DVR (700) Crossband/No Inband; For APX (UHF+700) using Unknown or User-Defined Antenna",3,6,3,2,932,0,2,"No Drawing",""]
[null,"X",null,null,null,"X",null,null,null,700,null,"X","X",null,"SINGLE","IB+XB","DVR (700) Inband & Crossband; For APX (UHF+700) using Single-Band Antenna(s)",3,6,5,0,936,8,2,"No Drawing",""]
[null,null,null,"QA09448AA",null,"X",null,null,null,700,null,"X","X",null,"ALL","IB+XB","DVR (700) Inband & Crossband; For APX (UHF+700) using One All-Band Antenna",3,6,5,1,937,6,2,"8J087X51-30",""]
[null,null,null,"QA09448AA",null,"X",null,null,null,700,null,"X","X",null,"USER","IB+XB","DVR (700) Inband & Crossband; For APX (UHF+700) using Unknown or User-Defined Antenna",3,6,5,2,938,6,2,"No Drawing",""]
[null,"X",null,null,null,"X",null,null,null,700,"X","X","X",null,"SINGLE","IB-Only","DVR (700) Inband/No Crossband; For APX (VHF+UHF+700) using Single-Band Antenna(s)",3,7,1,0,941,8,3,"No Drawing",""]
[null,null,null,null,null,"X",null,null,null,700,"X","X","X",null,"ALL","IB-Only","DVR (700) Inband/No Crossband; For APX (VHF+UHF+700) using One All-Band Antenna",3,7,1,1,942,6,3,"No Drawing",""]
[null,null,null,null,null,"X",null,null,null,700,"X","X","X",null,"USER","IB-Only","DVR (700) Inband/No Crossband; For APX (VHF+UHF+700) using Unknown or User-Defined Antenna",3,7,1,2,943,6,3,"No Drawing",""]
[null,"X",null,null,null,null,null,"QA09446AA",null,700,"X","X","X",null,"SINGLE","XB-Only","DVR (700) Crossband/No Inband; For APX (VHF+UHF+700) using Single-Band Antenna(s)",3,7,3,0,947,2,3,"8J087X51-57",""]
[null,null,null,null,"QA09445AA",null,null,null,null,700,"X","X","X",null,"ALL","XB-Only","DVR (700) Crossband/No Inband; For APX (VHF+UHF+700) using One All-Band Antenna",3,7,3,1,948,0,3,"8J087X51-39",""]
[null,null,null,null,"QA09445AA",null,null,null,null,700,"X","X","X",null,"USER","XB-Only","DVR (700) Crossband/No Inband; For APX (VHF+UHF+700) using Unknown or User-Defined Antenna",3,7,3,2,949,0,3,"No Drawing",""]
[null,"X",null,null,null,"X",null,null,null,700,"X","X","X",null,"SINGLE","IB+XB","DVR (700) Inband & Crossband; For APX (VHF+UHF+700) using Single-Band Antenna(s)",3,7,5,0,953,8,3,"No Drawing",""]
[null,null,null,"QA09448AA",null,"X",null,null,null,700,"X","X","X",null,"ALL","IB+XB","DVR (700) Inband & Crossband; For APX (VHF+UHF+700) using One All-Band Antenna",3,7,5,1,954,6,3,"8J087X51-36",""]
[null,null,null,"QA09448AA",null,"X",null,null,null,700,"X","X","X",null,"USER","IB+XB","DVR (700) Inband & Crossband; For APX (VHF+UHF+700) using Unknown or User-Defined Antenna",3,7,5,2,955,6,3,"No Drawing",""]
["X",null,null,null,null,"X",null,null,null,700,null,null,null,"X","SINGLE","IB-Forced","DVR (700) Inband; For APX (800) using Single-Band Antenna(s)",3,8,2,0,961,7,1,"No Drawing",""]
["X",null,null,null,null,"X",null,null,null,700,null,null,null,"X","ALL","IB-Forced","DVR (700) Inband; For APX (800) using One All-Band Antenna",3,8,2,1,962,7,1,"No Drawing",""]
["X",null,null,null,null,"X",null,null,null,700,null,null,null,"X","USER","IB-Forced","DVR (700) Inband; For APX (800) using Unknown or User-Defined Antenna",3,8,2,2,963,7,1,"No Drawing",""]
[null,null,null,null,null,null,null,null,"INVALID COMBO",700,null,null,null,"X","SINGLE","XB-Only","DVR (700) Crossband/No Inband; For APX (800) using Single-Band Antenna(s)",3,8,3,0,964,0,1,"No Drawing","INVALID COMBO"]
[null,null,null,null,null,null,null,null,"INVALID COMBO",700,null,null,null,"X","ALL","XB-Only","DVR (700) Crossband/No Inband; For APX (800) using One All-Band Antenna",3,8,3,1,965,0,1,"No Drawing","INVALID COMBO"]
[null,null,null,null,null,null,null,null,"INVALID COMBO",700,null,null,null,"X","USER","XB-Only","DVR (700) Crossband/No Inband; For APX (800) using Unknown or User-Defined Antenna",3,8,3,2,966,0,1,"No Drawing","INVALID COMBO"]
[null,"X",null,null,null,"X",null,null,null,700,"X",null,null,"X","SINGLE","IB-Only","DVR (700) Inband/No Crossband; For APX (VHF+800) using Single-Band Antenna(s)",3,9,1,0,975,8,2,"No Drawing",""]
[null,null,null,null,null,"X",null,null,null,700,"X",null,null,"X","ALL","IB-Only","DVR (700) Inband/No Crossband; For APX (VHF+800) using One All-Band Antenna",3,9,1,1,976,6,2,"No Drawing",""]
[null,null,null,null,null,"X",null,null,null,700,"X",null,null,"X","USER","IB-Only","DVR (700) Inband/No Crossband; For APX (VHF+800) using Unknown or User-Defined Antenna",3,9,1,2,977,6,2,"No Drawing",""]
[null,"X",null,null,null,null,null,"QA09446AA",null,700,"X",null,null,"X","SINGLE","XB-Only","DVR (700) Crossband/No Inband; For APX (VHF+800) using Single-Band Antenna(s)",3,9,3,0,981,2,2,"8J087X51-47",""]
[null,null,"QA09449AA",null,null,null,null,null,null,700,"X",null,null,"X","ALL","XB-Only","DVR (700) Crossband/No Inband; For APX (VHF+800) using One All-Band Antenna",3,9,3,1,982,0,2,"8J087X51-05",""]
[null,null,"QA09449AA",null,null,null,null,null,null,700,"X",null,null,"X","USER","XB-Only","DVR (700) Crossband/No Inband; For APX (VHF+800) using Unknown or User-Defined Antenna",3,9,3,2,983,0,2,"No Drawing",""]
[null,"X",null,null,null,"X",null,null,null,700,"X",null,null,"X","SINGLE","IB+XB","DVR (700) Inband & Crossband; For APX (VHF+800) using Single-Band Antenna(s)",3,9,5,0,987,8,2,"No Drawing",""]
[null,null,null,"QA09448AA",null,"X",null,null,null,700,"X",null,null,"X","ALL","IB+XB","DVR (700) Inband & Crossband; For APX (VHF+800) using One All-Band Antenna",3,9,5,1,988,6,2,"8J087X51-29",""]
[null,null,null,"QA09448AA",null,"X",null,null,null,700,"X",null,null,"X","USER","IB+XB","DVR (700) Inband & Crossband; For APX (VHF+800) using Unknown or User-Defined Antenna",3,9,5,2,989,6,2,"No Drawing",""]
[null,"X",null,null,null,"X",null,null,null,700,null,"X",null,"X","SINGLE","IB-Only","DVR (700) Inband/No Crossband; For APX (UHF+800) using Single-Band Antenna(s)",3,10,1,0,992,8,2,"No Drawing",""]
[null,null,null,null,null,"X",null,null,null,700,null,"X",null,"X","ALL","IB-Only","DVR (700) Inband/No Crossband; For APX (UHF+800) using One All-Band Antenna",3,10,1,1,993,6,2,"No Drawing",""]
[null,null,null,null,null,"X",null,null,null,700,null,"X",null,"X","USER","IB-Only","DVR (700) Inband/No Crossband; For APX (UHF+800) using Unknown or User-Defined Antenna",3,10,1,2,994,6,2,"No Drawing",""]
[null,"X",null,null,null,null,null,"QA09446AA",null,700,null,"X",null,"X","SINGLE","XB-Only","DVR (700) Crossband/No Inband; For APX (UHF+800) using Single-Band Antenna(s)",3,10,3,0,998,2,2,"8J087X51-48",""]
[null,null,"QA09449AA",null,null,null,null,null,null,700,null,"X",null,"X","ALL","XB-Only","DVR (700) Crossband/No Inband; For APX (UHF+800) using One All-Band Antenna",3,10,3,1,999,0,2,"8J087X51-06",""]
[null,null,"QA09449AA",null,null,null,null,null,null,700,null,"X",null,"X","USER","XB-Only","DVR (700) Crossband/No Inband; For APX (UHF+800) using Unknown or User-Defined Antenna",3,10,3,2,1000,0,2,"No Drawing",""]
[null,"X",null,null,null,"X",null,null,null,700,null,"X",null,"X","SINGLE","IB+XB","DVR (700) Inband & Crossband; For APX (UHF+800) using Single-Band Antenna(s)",3,10,5,0,1004,8,2,"No Drawing",""]
[null,null,null,"QA09448AA",null,"X",null,null,null,700,null,"X",null,"X","ALL","IB+XB","DVR (700) Inband & Crossband; For APX (UHF+800) using One All-Band Antenna",3,10,5,1,1005,6,2,"8J087X51-30",""]
[null,null,null,"QA09448AA",null,"X",null,null,null,700,null,"X",null,"X","USER","IB+XB","DVR (700) Inband & Crossband; For APX (UHF+800) using Unknown or User-Defined Antenna",3,10,5,2,1006,6,2,"No Drawing",""]
[null,"X",null,null,null,"X",null,null,null,700,"X","X",null,"X","SINGLE","IB-Only","DVR (700) Inband/No Crossband; For APX (VHF+UHF+800) using Single-Band Antenna(s)",3,11,1,0,1009,8,3,"No Drawing",""]
[null,null,null,null,null,"X",null,null,null,700,"X","X",null,"X","ALL","IB-Only","DVR (700) Inband/No Crossband; For APX (VHF+UHF+800) using One All-Band Antenna",3,11,1,1,1010,6,3,"No Drawing",""]
[null,null,null,null,null,"X",null,null,null,700,"X","X",null,"X","USER","IB-Only","DVR (700) Inband/No Crossband; For APX (VHF+UHF+800) using Unknown or User-Defined Antenna",3,11,1,2,1011,6,3,"No Drawing",""]
[null,"X",null,null,null,null,null,"QA09446AA",null,700,"X","X",null,"X","SINGLE","XB-Only","DVR (700) Crossband/No Inband; For APX (VHF+UHF+800) using Single-Band Antenna(s)",3,11,3,0,1015,2,3,"8J087X51-57",""]
[null,null,null,null,"QA09445AA",null,null,null,null,700,"X","X",null,"X","ALL","XB-Only","DVR (700) Crossband/No Inband; For APX (VHF+UHF+800) using One All-Band Antenna",3,11,3,1,1016,0,3,"8J087X51-39",""]
[null,null,null,null,"QA09445AA",null,null,null,null,700,"X","X",null,"X","USER","XB-Only","DVR (700) Crossband/No Inband; For APX (VHF+UHF+800) using Unknown or User-Defined Antenna",3,11,3,2,1017,0,3,"No Drawing",""]
[null,"X",null,null,null,"X",null,null,null,700,"X","X",null,"X","SINGLE","IB+XB","DVR (700) Inband & Crossband; For APX (VHF+UHF+800) using Single-Band Antenna(s)",3,11,5,0,1021,8,3,"No Drawing",""]
[null,null,null,"QA09448AA",null,"X",null,null,null,700,"X","X",null,"X","ALL","IB+XB","DVR (700) Inband & Crossband; For APX (VHF+UHF+800) using One All-Band Antenna",3,11,5,1,1022,6,3,"8J087X51-36",""]
[null,null,null,"QA09448AA",null,"X",null,null,null,700,"X","X",null,"X","USER","IB+XB","DVR (700) Inband & Crossband; For APX (VHF+UHF+800) using Unknown or User-Defined Antenna",3,11,5,2,1023,6,3,"No Drawing",""]
["X",null,null,null,null,"X",null,null,null,700,null,null,"X","X","SINGLE","IB-Forced","DVR (700) Inband; For APX (700+800) using Single-Band Antenna(s)",3,12,2,0,1029,7,1,"No Drawing",""]
["X",null,null,null,null,"X",null,null,null,700,null,null,"X","X","ALL","IB-Forced",{"$f":"$J$6&\"(\"&$J263&\")\"&\" \"&VLOOKUP($P263,RPTCodes,2,FALSE) &\"; For APX (\"&VLOOKUP($S263,BAND_NAMES,2)&\") using \"&VLOOKUP($O263,ANTcodes,3,FALSE)","v":"DVR (700) Inband; For APX (700+800) using One All-Band Antenna"},{"$f":"VLOOKUP(J263,Freq_Bands,2)","v":3},{"$f":"IF(K263=\"X\",1,0)+IF(L263=\"X\",2,0)+IF(M263=\"X\",4,0)+IF(N263=\"X\",8,0)","v":12},{"$f":"VLOOKUP(P263,RPTCodes,4,FALSE)","v":2},{"$f":"VLOOKUP(O263,ANTcodes,2,FALSE)","v":1},{"$f":"$U263*MULT_ANT+$T263*MULT_RPT+$S263*MULT_MRF+$R263*MULT_VRF","v":1030},{"$f":"IF($A263=\"X\",1,0)+IF($B263=\"X\",2,0)+IF($C263=\"X\",3,0)+IF($D263=\"X\",4,0)+IF($E263=\"X\",5,0)+IF($F263=\"X\",6,0)+IF($H263=\"X\",10,0)","v":7},{"$f":"COUNTA(K263:L263)+IF(RIGHT(M263&N263,1)=\"X\",1,0)","v":1},"No Drawing",{"$f":"IF(COUNTIF($A263:$H263, \"<>\"&\"\")=0,\"INVALID COMBO\",\"\")","v":""}]
["X",null,null,null,null,"X",null,null,null,700,null,null,"X","X","USER","IB-Forced","DVR (700) Inband; For APX (700+800) using Unknown or User-Defined Antenna",3,12,2,2,1031,7,1,"No Drawing",""]
[null,null,null,null,null,null,null,null,"INVALID COMBO",700,null,null,"X","X","SINGLE","XB-Only","DVR (700) Crossband/No Inband; For APX (700+800) using Single-Band Antenna(s)",3,12,3,0,1032,0,1,"No Drawing","INVALID COMBO"]
[null,null,null,null,null,null,null,null,"INVALID COMBO",700,null,null,"X","X","ALL","XB-Only","DVR (700) Crossband/No Inband; For APX (700+800) using One All-Band Antenna",3,12,3,1,1033,0,1,"No Drawing","INVALID COMBO"]
[null,null,null,null,null,null,null,null,"INVALID COMBO",700,null,null,"X","X","USER","XB-Only","DVR (700) Crossband/No Inband; For APX (700+800) using Unknown or User-Defined Antenna",3,12,3,2,1034,0,1,"No Drawing","INVALID COMBO"]
[null,"X",null,null,null,"X",null,null,null,700,"X",null,"X","X","SINGLE","IB-Only","DVR (700) Inband/No Crossband; For APX (VHF+700+800) using Single-Band Antenna(s)",3,13,1,0,1043,8,2,"No Drawing",""]
[null,null,null,null,null,"X",null,null,null,700,"X",null,"X","X","ALL","IB-Only","DVR (700) Inband/No Crossband; For APX (VHF+700+800) using One All-Band Antenna",3,13,1,1,1044,6,2,"No Drawing",""]
[null,null,null,null,null,"X",null,null,null,700,"X",null,"X","X","USER","IB-Only","DVR (700) Inband/No Crossband; For APX (VHF+700+800) using Unknown or User-Defined Antenna",3,13,1,2,1045,6,2,"No Drawing",""]
[null,"X",null,null,null,null,null,"QA09446AA",null,700,"X",null,"X","X","SINGLE","XB-Only","DVR (700) Crossband/No Inband; For APX (VHF+700+800) using Single-Band Antenna(s)",3,13,3,0,1049,2,2,"8J087X51-47",""]
[null,null,"QA09449AA",null,null,null,null,null,null,700,"X",null,"X","X","ALL","XB-Only","DVR (700) Crossband/No Inband; For APX (VHF+700+800) using One All-Band Antenna",3,13,3,1,1050,0,2,"8J087X51-05",""]
[null,null,"QA09449AA",null,null,null,null,null,null,700,"X",null,"X","X","USER","XB-Only","DVR (700) Crossband/No Inband; For APX (VHF+700+800) using Unknown or User-Defined Antenna",3,13,3,2,1051,0,2,"No Drawing",""]
[null,"X",null,null,null,"X",null,null,null,700,"X",null,"X","X","SINGLE","IB+XB","DVR (700) Inband & Crossband; For APX (VHF+700+800) using Single-Band Antenna(s)",3,13,5,0,1055,8,2,"No Drawing",""]
[null,null,null,"QA09448AA",null,"X",null,null,null,700,"X",null,"X","X","ALL","IB+XB","DVR (700) Inband & Crossband; For APX (VHF+700+800) using One All-Band Antenna",3,13,5,1,1056,6,2,"8J087X51-29",""]
[null,null,null,"QA09448AA",null,"X",null,null,null,700,"X",null,"X","X","USER","IB+XB","DVR (700) Inband & Crossband; For APX (VHF+700+800) using Unknown or User-Defined Antenna",3,13,5,2,1057,6,2,"No Drawing",""]
[null,"X",null,null,null,"X",null,null,null,700,null,"X","X","X","SINGLE","IB-Only","DVR (700) Inband/No Crossband; For APX (UHF+700+800) using Single-Band Antenna(s)",3,14,1,0,1060,8,2,"No Drawing",""]
[null,null,null,null,null,"X",null,null,null,700,null,"X","X","X","ALL","IB-Only","DVR (700) Inband/No Crossband; For APX (UHF+700+800) using One All-Band Antenna",3,14,1,1,1061,6,2,"No Drawing",""]
[null,null,null,null,null,"X",null,null,null,700,null,"X","X","X","USER","IB-Only","DVR (700) Inband/No Crossband; For APX (UHF+700+800) using Unknown or User-Defined Antenna",3,14,1,2,1062,6,2,"No Drawing",""]
[null,"X",null,null,null,null,null,"QA09446AA",null,700,null,"X","X","X","SINGLE","XB-Only","DVR (700) Crossband/No Inband; For APX (UHF+700+800) using Single-Band Antenna(s)",3,14,3,0,1066,2,2,"8J087X51-48",""]
[null,null,"QA09449AA",null,null,null,null,null,null,700,null,"X","X","X","ALL","XB-Only","DVR (700) Crossband/No Inband; For APX (UHF+700+800) using One All-Band Antenna",3,14,3,1,1067,0,2,"8J087X51-06",""]
[null,null,"QA09449AA",null,null,null,null,null,null,700,null,"X","X","X","USER","XB-Only","DVR (700) Crossband/No Inband; For APX (UHF+700+800) using Unknown or User-Defined Antenna",3,14,3,2,1068,0,2,"No Drawing",""]
[null,"X",null,null,null,"X",null,null,null,700,null,"X","X","X","SINGLE","IB+XB","DVR (700) Inband & Crossband; For APX (UHF+700+800) using Single-Band Antenna(s)",3,14,5,0,1072,8,2,"No Drawing",""]
[null,null,null,"QA09448AA",null,"X",null,null,null,700,null,"X","X","X","ALL","IB+XB","DVR (700) Inband & Crossband; For APX (UHF+700+800) using One All-Band Antenna",3,14,5,1,1073,6,2,"8J087X51-30",""]
[null,null,null,"QA09448AA",null,"X",null,null,null,700,null,"X","X","X","USER","IB+XB","DVR (700) Inband & Crossband; For APX (UHF+700+800) using Unknown or User-Defined Antenna",3,14,5,2,1074,6,2,"No Drawing",""]
[null,"X",null,null,null,"X",null,null,null,700,"X","X","X","X","SINGLE","IB-Only","DVR (700) Inband/No Crossband; For APX (VHF+UHF+700+800) using Single-Band Antenna(s)",3,15,1,0,1077,8,3,"No Drawing",""]
[null,null,null,null,null,"X",null,null,null,700,"X","X","X","X","ALL","IB-Only","DVR (700) Inband/No Crossband; For APX (VHF+UHF+700+800) using One All-Band Antenna",3,15,1,1,1078,6,3,"No Drawing",""]
[null,null,null,null,null,"X",null,null,null,700,"X","X","X","X","USER","IB-Only","DVR (700) Inband/No Crossband; For APX (VHF+UHF+700+800) using Unknown or User-Defined Antenna",3,15,1,2,1079,6,3,"No Drawing",""]
[null,"X",null,null,null,null,null,"QA09446AA",null,700,"X","X","X","X","SINGLE","XB-Only","DVR (700) Crossband/No Inband; For APX (VHF+UHF+700+800) using Single-Band Antenna(s)",3,15,3,0,1083,2,3,"8J087X51-57",""]
[null,null,null,null,"QA09445AA",null,null,null,null,700,"X","X","X","X","ALL","XB-Only","DVR (700) Crossband/No Inband; For APX (VHF+UHF+700+800) using One All-Band Antenna",3,15,3,1,1084,0,3,"8J087X51-39",""]
[null,null,null,null,"QA09445AA",null,null,null,null,700,"X","X","X","X","USER","XB-Only","DVR (700) Crossband/No Inband; For APX (VHF+UHF+700+800) using Unknown or User-Defined Antenna",3,15,3,2,1085,0,3,"No Drawing",""]
[null,"X",null,null,null,"X",null,null,null,700,"X","X","X","X","SINGLE","IB+XB","DVR (700) Inband & Crossband; For APX (VHF+UHF+700+800) using Single-Band Antenna(s)",3,15,5,0,1089,8,3,"No Drawing",""]
[null,null,null,"QA09448AA",null,"X",null,null,null,700,"X","X","X","X","ALL","IB+XB","DVR (700) Inband & Crossband; For APX (VHF+UHF+700+800) using One All-Band Antenna",3,15,5,1,1090,6,3,"8J087X51-36",""]
[null,null,null,"QA09448AA",null,"X",null,null,null,700,"X","X","X","X","USER","IB+XB","DVR (700) Inband & Crossband; For APX (VHF+UHF+700+800) using Unknown or User-Defined Antenna",3,15,5,2,1091,6,3,"No Drawing",""]
[null,"X",null,null,null,null,null,null,null,800,"X",null,null,null,"SINGLE","XB-Forced","DVR (800) Crossband; For APX (VHF) using Single-Band Antenna(s)",4,1,4,0,1121,2,1,"No Drawing",""]
[null,"X",null,null,null,null,null,null,null,800,"X",null,null,null,"ALL","XB-Forced","DVR (800) Crossband; For APX (VHF) using One All-Band Antenna",4,1,4,1,1122,2,1,"No Drawing",""]
[null,"X",null,null,null,null,null,null,null,800,"X",null,null,null,"USER","XB-Forced","DVR (800) Crossband; For APX (VHF) using Unknown or User-Defined Antenna",4,1,4,2,1123,2,1,"No Drawing",""]
[null,"X",null,null,null,null,null,null,null,800,null,"X",null,null,"SINGLE","XB-Forced","DVR (800) Crossband; For APX (UHF) using Single-Band Antenna(s)",4,2,4,0,1138,2,1,"No Drawing",""]
[null,"X",null,null,null,null,null,null,null,800,null,"X",null,null,"ALL","XB-Forced","DVR (800) Crossband; For APX (UHF) using One All-Band Antenna",4,2,4,1,1139,2,1,"No Drawing",""]
[null,"X",null,null,null,null,null,null,null,800,null,"X",null,null,"USER","XB-Forced","DVR (800) Crossband; For APX (UHF) using Unknown or User-Defined Antenna",4,2,4,2,1140,2,1,"No Drawing",""]
[null,"X",null,null,null,null,null,null,null,800,"X","X",null,null,"SINGLE","XB-Forced","DVR (800) Crossband; For APX (VHF+UHF) using Single-Band Antenna(s)",4,3,4,0,1155,2,2,"No Drawing",""]
[null,null,null,"QA09447AA",null,null,null,null,null,800,"X","X",null,null,"ALL","XB-Forced","DVR (800) Crossband; For APX (VHF+UHF) using One All-Band Antenna",4,3,4,1,1156,0,2,"8J087X51-18",""]
[null,null,null,"QA09447AA",null,null,null,null,null,800,"X","X",null,null,"USER","XB-Forced","DVR (800) Crossband; For APX (VHF+UHF) using Unknown or User-Defined Antenna",4,3,4,2,1157,0,2,"No Drawing",""]
["X",null,null,null,null,"X",null,null,null,800,null,null,"X",null,"SINGLE","IB-Forced","DVR (800) Inband; For APX (700) using Single-Band Antenna(s)",4,4,2,0,1166,7,1,"No Drawing",""]
["X",null,null,null,null,"X",null,null,null,800,null,null,"X",null,"ALL","IB-Forced","DVR (800) Inband; For APX (700) using One All-Band Antenna",4,4,2,1,1167,7,1,"No Drawing",""]
["X",null,null,null,null,"X",null,null,null,800,null,null,"X",null,"USER","IB-Forced","DVR (800) Inband; For APX (700) using Unknown or User-Defined Antenna",4,4,2,2,1168,7,1,"No Drawing",""]
[null,null,null,null,null,null,null,null,"INVALID COMBO",800,null,null,"X",null,"SINGLE","XB-Only","DVR (800) Crossband/No Inband; For APX (700) using Single-Band Antenna(s)",4,4,3,0,1169,0,1,"No Drawing","INVALID COMBO"]
[null,null,null,null,null,null,null,null,"INVALID COMBO",800,null,null,"X",null,"ALL","XB-Only","DVR (800) Crossband/No Inband; For APX (700) using One All-Band Antenna",4,4,3,1,1170,0,1,"No Drawing","INVALID COMBO"]
[null,null,null,null,null,null,null,null,"INVALID COMBO",800,null,null,"X",null,"USER","XB-Only","DVR (800) Crossband/No Inband; For APX (700) using Unknown or User-Defined Antenna",4,4,3,2,1171,0,1,"No Drawing","INVALID COMBO"]
[null,"X",null,null,null,"X",null,null,null,800,"X",null,"X",null,"SINGLE","IB-Only","DVR (800) Inband/No Crossband; For APX (VHF+700) using Single-Band Antenna(s)",4,5,1,0,1180,8,2,"No Drawing",""]
[null,null,null,null,null,"X",null,null,null,800,"X",null,"X",null,"ALL","IB-Only","DVR (800) Inband/No Crossband; For APX (VHF+700) using One All-Band Antenna",4,5,1,1,1181,6,2,"No Drawing",""]
[null,null,null,null,null,"X",null,null,null,800,"X",null,"X",null,"USER","IB-Only","DVR (800) Inband/No Crossband; For APX (VHF+700) using Unknown or User-Defined Antenna",4,5,1,2,1182,6,2,"No Drawing",""]
[null,"X",null,null,null,null,null,"QA09446AA",null,800,"X",null,"X",null,"SINGLE","XB-Only","DVR (800) Crossband/No Inband; For APX (VHF+700) using Single-Band Antenna(s)",4,5,3,0,1186,2,2,"8J087X51-47",""]
[null,null,"QA09449AA",null,null,null,null,null,null,800,"X",null,"X",null,"ALL","XB-Only","DVR (800) Crossband/No Inband; For APX (VHF+700) using One All-Band Antenna",4,5,3,1,1187,0,2,"8J087X51-05",""]
[null,null,"QA09449AA",null,null,null,null,null,null,800,"X",null,"X",null,"USER","XB-Only","DVR (800) Crossband/No Inband; For APX (VHF+700) using Unknown or User-Defined Antenna",4,5,3,2,1188,0,2,"No Drawing",""]
[null,"X",null,null,null,"X",null,null,null,800,"X",null,"X",null,"SINGLE","IB+XB","DVR (800) Inband & Crossband; For APX (VHF+700) using Single-Band Antenna(s)",4,5,5,0,1192,8,2,"No Drawing",""]
[null,null,null,"QA09448AA",null,"X",null,null,null,800,"X",null,"X",null,"ALL","IB+XB","DVR (800) Inband & Crossband; For APX (VHF+700) using One All-Band Antenna",4,5,5,1,1193,6,2,"8J087X51-29",""]
[null,null,null,"QA09448AA",null,"X",null,null,null,800,"X",null,"X",null,"USER","IB+XB","DVR (800) Inband & Crossband; For APX (VHF+700) using Unknown or User-Defined Antenna",4,5,5,2,1194,6,2,"No Drawing",""]
[null,"X",null,null,null,"X",null,null,null,800,null,"X","X",null,"SINGLE","IB-Only","DVR (800) Inband/No Crossband; For APX (UHF+700) using Single-Band Antenna(s)",4,6,1,0,1197,8,2,"No Drawing",""]
[null,null,null,null,null,"X",null,null,null,800,null,"X","X",null,"ALL","IB-Only","DVR (800) Inband/No Crossband; For APX (UHF+700) using One All-Band Antenna",4,6,1,1,1198,6,2,"No Drawing",""]
[null,null,null,null,null,"X",null,null,null,800,null,"X","X",null,"USER","IB-Only","DVR (800) Inband/No Crossband; For APX (UHF+700) using Unknown or User-Defined Antenna",4,6,1,2,1199,6,2,"No Drawing",""]
[null,"X",null,null,null,null,null,"QA09446AA",null,800,null,"X","X",null,"SINGLE","XB-Only","DVR (800) Crossband/No Inband; For APX (UHF+700) using Single-Band Antenna(s)",4,6,3,0,1203,2,2,"8J087X51-48",""]
[null,null,"QA09449AA",null,null,null,null,null,null,800,null,"X","X",null,"ALL","XB-Only","DVR (800) Crossband/No Inband; For APX (UHF+700) using One All-Band Antenna",4,6,3,1,1204,0,2,"8J087X51-06",""]
[null,null,"QA09449AA",null,null,null,null,null,null,800,null,"X","X",null,"USER","XB-Only","DVR (800) Crossband/No Inband; For APX (UHF+700) using Unknown or User-Defined Antenna",4,6,3,2,1205,0,2,"No Drawing",""]
[null,"X",null,null,null,"X",null,null,null,800,null,"X","X",null,"SINGLE","IB+XB","DVR (800) Inband & Crossband; For APX (UHF+700) using Single-Band Antenna(s)",4,6,5,0,1209,8,2,"No Drawing",""]
[null,null,null,"QA09448AA",null,"X",null,null,null,800,null,"X","X",null,"ALL","IB+XB","DVR (800) Inband & Crossband; For APX (UHF+700) using One All-Band Antenna",4,6,5,1,1210,6,2,"8J087X51-30",""]
[null,null,null,"QA09448AA",null,"X",null,null,null,800,null,"X","X",null,"USER","IB+XB",{"$f":"$J$6&\"(\"&$J327&\")\"&\" \"&VLOOKUP($P327,RPTCodes,2,FALSE) &\"; For APX (\"&VLOOKUP($S327,BAND_NAMES,2)&\") using \"&VLOOKUP($O327,ANTcodes,3,FALSE)","v":"DVR (800) Inband & Crossband; For APX (UHF+700) using Unknown or User-Defined Antenna"},{"$f":"VLOOKUP(J327,Freq_Bands,2)","v":4},{"$f":"IF(K327=\"X\",1,0)+IF(L327=\"X\",2,0)+IF(M327=\"X\",4,0)+IF(N327=\"X\",8,0)","v":6},{"$f":"VLOOKUP(P327,RPTCodes,4,FALSE)","v":5},{"$f":"VLOOKUP(O327,ANTcodes,2,FALSE)","v":2},{"$f":"$U327*MULT_ANT+$T327*MULT_RPT+$S327*MULT_MRF+$R327*MULT_VRF","v":1211},{"$f":"IF($A327=\"X\",1,0)+IF($B327=\"X\",2,0)+IF($C327=\"X\",3,0)+IF($D327=\"X\",4,0)+IF($E327=\"X\",5,0)+IF($F327=\"X\",6,0)+IF($H327=\"X\",10,0)","v":6},{"$f":"COUNTA(K327:L327)+IF(RIGHT(M327&N327,1)=\"X\",1,0)","v":2},"No Drawing",{"$f":"IF(COUNTIF($A327:$H327, \"<>\"&\"\")=0,\"INVALID COMBO\",\"\")","v":""}]
[null,"X",null,null,null,"X",null,null,null,800,"X","X","X",null,"SINGLE","IB-Only","DVR (800) Inband/No Crossband; For APX (VHF+UHF+700) using Single-Band Antenna(s)",4,7,1,0,1214,8,3,"No Drawing",""]
[null,null,null,null,null,"X",null,null,null,800,"X","X","X",null,"ALL","IB-Only","DVR (800) Inband/No Crossband; For APX (VHF+UHF+700) using One All-Band Antenna",4,7,1,1,1215,6,3,"No Drawing",""]
[null,null,null,null,null,"X",null,null,null,800,"X","X","X",null,"USER","IB-Only","DVR (800) Inband/No Crossband; For APX (VHF+UHF+700) using Unknown or User-Defined Antenna",4,7,1,2,1216,6,3,"No Drawing",""]
[null,"X",null,null,null,null,null,"QA09446AA",null,800,"X","X","X",null,"SINGLE","XB-Only","DVR (800) Crossband/No Inband; For APX (VHF+UHF+700) using Single-Band Antenna(s)",4,7,3,0,1220,2,3,"8J087X51-57",""]
[null,null,null,null,"QA09445AA",null,null,null,null,800,"X","X","X",null,"ALL","XB-Only","DVR (800) Crossband/No Inband; For APX (VHF+UHF+700) using One All-Band Antenna",4,7,3,1,1221,0,3,"8J087X51-39",""]
[null,null,null,null,"QA09445AA",null,null,null,null,800,"X","X","X",null,"USER","XB-Only","DVR (800) Crossband/No Inband; For APX (VHF+UHF+700) using Unknown or User-Defined Antenna",4,7,3,2,1222,0,3,"No Drawing",""]
[null,"X",null,null,null,"X",null,null,null,800,"X","X","X",null,"SINGLE","IB+XB","DVR (800) Inband & Crossband; For APX (VHF+UHF+700) using Single-Band Antenna(s)",4,7,5,0,1226,8,3,"No Drawing",""]
[null,null,null,"QA09448AA",null,"X",null,null,null,800,"X","X","X",null,"ALL","IB+XB","DVR (800) Inband & Crossband; For APX (VHF+UHF+700) using One All-Band Antenna",4,7,5,1,1227,6,3,"8J087X51-36",""]
[null,null,null,"QA09448AA",null,"X",null,null,null,800,"X","X","X",null,"USER","IB+XB","DVR (800) Inband & Crossband; For APX (VHF+UHF+700) using Unknown or User-Defined Antenna",4,7,5,2,1228,6,3,"No Drawing",""]
["X",null,null,null,null,"X",null,null,null,800,null,null,null,"X","SINGLE","IB-Forced","DVR (800) Inband; For APX (800) using Single-Band Antenna(s)",4,8,2,0,1234,7,1,"No Drawing",""]
["X",null,null,null,null,"X",null,null,null,800,null,null,null,"X","ALL","IB-Forced","DVR (800) Inband; For APX (800) using One All-Band Antenna",4,8,2,1,1235,7,1,"No Drawing",""]
["X",null,null,null,null,"X",null,null,null,800,null,null,null,"X","USER","IB-Forced","DVR (800) Inband; For APX (800) using Unknown or User-Defined Antenna",4,8,2,2,1236,7,1,"No Drawing",""]
[null,null,null,null,null,null,null,null,"INVALID COMBO",800,null,null,null,"X","SINGLE","XB-Only","DVR (800) Crossband/No Inband; For APX (800) using Single-Band Antenna(s)",4,8,3,0,1237,0,1,"No Drawing","INVALID COMBO"]
[null,null,null,null,null,null,null,null,"INVALID COMBO",800,null,null,null,"X","ALL","XB-Only","DVR (800) Crossband/No Inband; For APX (800) using One All-Band Antenna",4,8,3,1,1238,0,1,"No Drawing","INVALID COMBO"]
[null,null,null,null,null,null,null,null,"INVALID COMBO",800,null,null,null,"X","USER","XB-Only","DVR (800) Crossband/No Inband; For APX (800) using Unknown or User-Defined Antenna",4,8,3,2,1239,0,1,"No Drawing","INVALID COMBO"]
[null,"X",null,null,null,"X",null,null,null,800,"X",null,null,"X","SINGLE","IB-Only","DVR (800) Inband/No Crossband; For APX (VHF+800) using Single-Band Antenna(s)",4,9,1,0,1248,8,2,"No Drawing",""]
[null,null,null,null,null,"X",null,null,null,800,"X",null,null,"X","ALL","IB-Only","DVR (800) Inband/No Crossband; For APX (VHF+800) using One All-Band Antenna",4,9,1,1,1249,6,2,"No Drawing",""]
[null,null,null,null,null,"X",null,null,null,800,"X",null,null,"X","USER","IB-Only","DVR (800) Inband/No Crossband; For APX (VHF+800) using Unknown or User-Defined Antenna",4,9,1,2,1250,6,2,"No Drawing",""]
[null,"X",null,null,null,null,null,"QA09446AA",null,800,"X",null,null,"X","SINGLE","XB-Only","DVR (800) Crossband/No Inband; For APX (VHF+800) using Single-Band Antenna(s)",4,9,3,0,1254,2,2,"8J087X51-47",""]
[null,null,"QA09449AA",null,null,null,null,null,null,800,"X",null,null,"X","ALL","XB-Only","DVR (800) Crossband/No Inband; For APX (VHF+800) using One All-Band Antenna",4,9,3,1,1255,0,2,"8J087X51-05",""]
[null,null,"QA09449AA",null,null,null,null,null,null,800,"X",null,null,"X","USER","XB-Only","DVR (800) Crossband/No Inband; For APX (VHF+800) using Unknown or User-Defined Antenna",4,9,3,2,1256,0,2,"No Drawing",""]
[null,"X",null,null,null,"X",null,null,null,800,"X",null,null,"X","SINGLE","IB+XB","DVR (800) Inband & Crossband; For APX (VHF+800) using Single-Band Antenna(s)",4,9,5,0,1260,8,2,"No Drawing",""]
[null,null,null,"QA09448AA",null,"X",null,null,null,800,"X",null,null,"X","ALL","IB+XB","DVR (800) Inband & Crossband; For APX (VHF+800) using One All-Band Antenna",4,9,5,1,1261,6,2,"8J087X51-29",""]
[null,null,null,"QA09448AA",null,"X",null,null,null,800,"X",null,null,"X","USER","IB+XB","DVR (800) Inband & Crossband; For APX (VHF+800) using Unknown or User-Defined Antenna",4,9,5,2,1262,6,2,"No Drawing",""]
[null,"X",null,null,null,"X",null,null,null,800,null,"X",null,"X","SINGLE","IB-Only","DVR (800) Inband/No Crossband; For APX (UHF+800) using Single-Band Antenna(s)",4,10,1,0,1265,8,2,"No Drawing",""]
[null,null,null,null,null,"X",null,null,null,800,null,"X",null,"X","ALL","IB-Only","DVR (800) Inband/No Crossband; For APX (UHF+800) using One All-Band Antenna",4,10,1,1,1266,6,2,"No Drawing",""]
[null,null,null,null,null,"X",null,null,null,800,null,"X",null,"X","USER","IB-Only","DVR (800) Inband/No Crossband; For APX (UHF+800) using Unknown or User-Defined Antenna",4,10,1,2,1267,6,2,"No Drawing",""]
[null,"X",null,null,null,null,null,"QA09446AA",null,800,null,"X",null,"X","SINGLE","XB-Only","DVR (800) Crossband/No Inband; For APX (UHF+800) using Single-Band Antenna(s)",4,10,3,0,1271,2,2,"8J087X51-48",""]
[null,null,"QA09449AA",null,null,null,null,null,null,800,null,"X",null,"X","ALL","XB-Only","DVR (800) Crossband/No Inband; For APX (UHF+800) using One All-Band Antenna",4,10,3,1,1272,0,2,"8J087X51-06",""]
[null,null,"QA09449AA",null,null,null,null,null,null,800,null,"X",null,"X","USER","XB-Only","DVR (800) Crossband/No Inband; For APX (UHF+800) using Unknown or User-Defined Antenna",4,10,3,2,1273,0,2,"No Drawing",""]
[null,"X",null,null,null,"X",null,null,null,800,null,"X",null,"X","SINGLE","IB+XB","DVR (800) Inband & Crossband; For APX (UHF+800) using Single-Band Antenna(s)",4,10,5,0,1277,8,2,"No Drawing",""]
[null,null,null,"QA09448AA",null,"X",null,null,null,800,null,"X",null,"X","ALL","IB+XB","DVR (800) Inband & Crossband; For APX (UHF+800) using One All-Band Antenna",4,10,5,1,1278,6,2,"8J087X51-30",""]
[null,null,null,"QA09448AA",null,"X",null,null,null,800,null,"X",null,"X","USER","IB+XB","DVR (800) Inband & Crossband; For APX (UHF+800) using Unknown or User-Defined Antenna",4,10,5,2,1279,6,2,"No Drawing",""]
[null,"X",null,null,null,"X",null,null,null,800,"X","X",null,"X","SINGLE","IB-Only","DVR (800) Inband/No Crossband; For APX (VHF+UHF+800) using Single-Band Antenna(s)",4,11,1,0,1282,8,3,"No Drawing",""]
[null,null,null,null,null,"X",null,null,null,800,"X","X",null,"X","ALL","IB-Only","DVR (800) Inband/No Crossband; For APX (VHF+UHF+800) using One All-Band Antenna",4,11,1,1,1283,6,3,"No Drawing",""]
[null,null,null,null,null,"X",null,null,null,800,"X","X",null,"X","USER","IB-Only","DVR (800) Inband/No Crossband; For APX (VHF+UHF+800) using Unknown or User-Defined Antenna",4,11,1,2,1284,6,3,"No Drawing",""]
[null,"X",null,null,null,null,null,"QA09446AA",null,800,"X","X",null,"X","SINGLE","XB-Only","DVR (800) Crossband/No Inband; For APX (VHF+UHF+800) using Single-Band Antenna(s)",4,11,3,0,1288,2,3,"8J087X51-57",""]
[null,null,null,null,"QA09445AA",null,null,null,null,800,"X","X",null,"X","ALL","XB-Only","DVR (800) Crossband/No Inband; For APX (VHF+UHF+800) using One All-Band Antenna",4,11,3,1,1289,0,3,"8J087X51-39",""]
[null,null,null,null,"QA09445AA",null,null,null,null,800,"X","X",null,"X","USER","XB-Only","DVR (800) Crossband/No Inband; For APX (VHF+UHF+800) using Unknown or User-Defined Antenna",4,11,3,2,1290,0,3,"No Drawing",""]
[null,"X",null,null,null,"X",null,null,null,800,"X","X",null,"X","SINGLE","IB+XB","DVR (800) Inband & Crossband; For APX (VHF+UHF+800) using Single-Band Antenna(s)",4,11,5,0,1294,8,3,"No Drawing",""]
[null,null,null,"QA09448AA",null,"X",null,null,null,800,"X","X",null,"X","ALL","IB+XB","DVR (800) Inband & Crossband; For APX (VHF+UHF+800) using One All-Band Antenna",4,11,5,1,1295,6,3,"8J087X51-36",""]
[null,null,null,"QA09448AA",null,"X",null,null,null,800,"X","X",null,"X","USER","IB+XB","DVR (800) Inband & Crossband; For APX (VHF+UHF+800) using Unknown or User-Defined Antenna",4,11,5,2,1296,6,3,"No Drawing",""]
["X",null,null,null,null,"X",null,null,null,800,null,null,"X","X","SINGLE","IB-Forced","DVR (800) Inband; For APX (700+800) using Single-Band Antenna(s)",4,12,2,0,1302,7,1,"No Drawing",""]
["X",null,null,null,null,"X",null,null,null,800,null,null,"X","X","ALL","IB-Forced","DVR (800) Inband; For APX (700+800) using One All-Band Antenna",4,12,2,1,1303,7,1,"No Drawing",""]
["X",null,null,null,null,"X",null,null,null,800,null,null,"X","X","USER","IB-Forced","DVR (800) Inband; For APX (700+800) using Unknown or User-Defined Antenna",4,12,2,2,1304,7,1,"No Drawing",""]
[null,null,null,null,null,null,null,null,"INVALID COMBO",800,null,null,"X","X","SINGLE","XB-Only","DVR (800) Crossband/No Inband; For APX (700+800) using Single-Band Antenna(s)",4,12,3,0,1305,0,1,"No Drawing","INVALID COMBO"]
[null,null,null,null,null,null,null,null,"INVALID COMBO",800,null,null,"X","X","ALL","XB-Only","DVR (800) Crossband/No Inband; For APX (700+800) using One All-Band Antenna",4,12,3,1,1306,0,1,"No Drawing","INVALID COMBO"]
[null,null,null,null,null,null,null,null,"INVALID COMBO",800,null,null,"X","X","USER","XB-Only","DVR (800) Crossband/No Inband; For APX (700+800) using Unknown or User-Defined Antenna",4,12,3,2,1307,0,1,"No Drawing","INVALID COMBO"]
[null,"X",null,null,null,"X",null,null,null,800,"X",null,"X","X","SINGLE","IB-Only","DVR (800) Inband/No Crossband; For APX (VHF+700+800) using Single-Band Antenna(s)",4,13,1,0,1316,8,2,"No Drawing",""]
[null,null,null,null,null,"X",null,null,null,800,"X",null,"X","X","ALL","IB-Only","DVR (800) Inband/No Crossband; For APX (VHF+700+800) using One All-Band Antenna",4,13,1,1,1317,6,2,"No Drawing",""]
[null,null,null,null,null,"X",null,null,null,800,"X",null,"X","X","USER","IB-Only","DVR (800) Inband/No Crossband; For APX (VHF+700+800) using Unknown or User-Defined Antenna",4,13,1,2,1318,6,2,"No Drawing",""]
[null,"X",null,null,null,null,null,"QA09446AA",null,800,"X",null,"X","X","SINGLE","XB-Only","DVR (800) Crossband/No Inband; For APX (VHF+700+800) using Single-Band Antenna(s)",4,13,3,0,1322,2,2,"8J087X51-47",""]
[null,null,"QA09449AA",null,null,null,null,null,null,800,"X",null,"X","X","ALL","XB-Only","DVR (800) Crossband/No Inband; For APX (VHF+700+800) using One All-Band Antenna",4,13,3,1,1323,0,2,"8J087X51-05",""]
[null,null,"QA09449AA",null,null,null,null,null,null,800,"X",null,"X","X","USER","XB-Only","DVR (800) Crossband/No Inband; For APX (VHF+700+800) using Unknown or User-Defined Antenna",4,13,3,2,1324,0,2,"No Drawing",""]
[null,"X",null,null,null,"X",null,null,null,800,"X",null,"X","X","SINGLE","IB+XB","DVR (800) Inband & Crossband; For APX (VHF+700+800) using Single-Band Antenna(s)",4,13,5,0,1328,8,2,"No Drawing",""]
[null,null,null,"QA09448AA",null,"X",null,null,null,800,"X",null,"X","X","ALL","IB+XB","DVR (800) Inband & Crossband; For APX (VHF+700+800) using One All-Band Antenna",4,13,5,1,1329,6,2,"8J087X51-29",""]
[null,null,null,"QA09448AA",null,"X",null,null,null,800,"X",null,"X","X","USER","IB+XB","DVR (800) Inband & Crossband; For APX (VHF+700+800) using Unknown or User-Defined Antenna",4,13,5,2,1330,6,2,"No Drawing",""]
[null,"X",null,null,null,"X",null,null,null,800,null,"X","X","X","SINGLE","IB-Only","DVR (800) Inband/No Crossband; For APX (UHF+700+800) using Single-Band Antenna(s)",4,14,1,0,1333,8,2,"No Drawing",""]
[null,null,null,null,null,"X",null,null,null,800,null,"X","X","X","ALL","IB-Only","DVR (800) Inband/No Crossband; For APX (UHF+700+800) using One All-Band Antenna",4,14,1,1,1334,6,2,"No Drawing",""]
[null,null,null,null,null,"X",null,null,null,800,null,"X","X","X","USER","IB-Only","DVR (800) Inband/No Crossband; For APX (UHF+700+800) using Unknown or User-Defined Antenna",4,14,1,2,1335,6,2,"No Drawing",""]
[null,"X",null,null,null,null,null,"QA09446AA",null,800,null,"X","X","X","SINGLE","XB-Only","DVR (800) Crossband/No Inband; For APX (UHF+700+800) using Single-Band Antenna(s)",4,14,3,0,1339,2,2,"8J087X51-48",""]
[null,null,"QA09449AA",null,null,null,null,null,null,800,null,"X","X","X","ALL","XB-Only","DVR (800) Crossband/No Inband; For APX (UHF+700+800) using One All-Band Antenna",4,14,3,1,1340,0,2,"8J087X51-06",""]
[null,null,"QA09449AA",null,null,null,null,null,null,800,null,"X","X","X","USER","XB-Only","DVR (800) Crossband/No Inband; For APX (UHF+700+800) using Unknown or User-Defined Antenna",4,14,3,2,1341,0,2,"No Drawing",""]
[null,"X",null,null,null,"X",null,null,null,800,null,"X","X","X","SINGLE","IB+XB",{"$f":"$J$6&\"(\"&$J391&\")\"&\" \"&VLOOKUP($P391,RPTCodes,2,FALSE) &\"; For APX (\"&VLOOKUP($S391,BAND_NAMES,2)&\") using \"&VLOOKUP($O391,ANTcodes,3,FALSE)","v":"DVR (800) Inband & Crossband; For APX (UHF+700+800) using Single-Band Antenna(s)"},{"$f":"VLOOKUP(J391,Freq_Bands,2)","v":4},{"$f":"IF(K391=\"X\",1,0)+IF(L391=\"X\",2,0)+IF(M391=\"X\",4,0)+IF(N391=\"X\",8,0)","v":14},{"$f":"VLOOKUP(P391,RPTCodes,4,FALSE)","v":5},{"$f":"VLOOKUP(O391,ANTcodes,2,FALSE)","v":0},{"$f":"$U391*MULT_ANT+$T391*MULT_RPT+$S391*MULT_MRF+$R391*MULT_VRF","v":1345},{"$f":"IF($A391=\"X\",1,0)+IF($B391=\"X\",2,0)+IF($C391=\"X\",3,0)+IF($D391=\"X\",4,0)+IF($E391=\"X\",5,0)+IF($F391=\"X\",6,0)+IF($H391=\"X\",10,0)","v":8},{"$f":"COUNTA(K391:L391)+IF(RIGHT(M391&N391,1)=\"X\",1,0)","v":2},"No Drawing",{"$f":"IF(COUNTIF($A391:$H391, \"<>\"&\"\")=0,\"INVALID COMBO\",\"\")","v":""}]
[null,null,null,"QA09448AA",null,"X",null,null,null,800,null,"X","X","X","ALL","IB+XB","DVR (800) Inband & Crossband; For APX (UHF+700+800) using One All-Band Antenna",4,14,5,1,1346,6,2,"8J087X51-30",""]
[null,null,null,"QA09448AA",null,"X",null,null,null,800,null,"X","X","X","USER","IB+XB","DVR (800) Inband & Crossband; For APX (UHF+700+800) using Unknown or User-Defined Antenna",4,14,5,2,1347,6,2,"No Drawing",""]
[null,"X",null,null,null,"X",null,null,null,800,"X","X","X","X","SINGLE","IB-Only","DVR (800) Inband/No Crossband; For APX (VHF+UHF+700+800) using Single-Band Antenna(s)",4,15,1,0,1350,8,3,"No Drawing",""]
[null,null,null,null,null,"X",null,null,null,800,"X","X","X","X","ALL","IB-Only","DVR (800) Inband/No Crossband; For APX (VHF+UHF+700+800) using One All-Band Antenna",4,15,1,1,1351,6,3,"No Drawing",""]
[null,null,null,null,null,"X",null,null,null,800,"X","X","X","X","USER","IB-Only","DVR (800) Inband/No Crossband; For APX (VHF+UHF+700+800) using Unknown or User-Defined Antenna",4,15,1,2,1352,6,3,"No Drawing",""]
[null,"X",null,null,null,null,null,"QA09446AA",null,800,"X","X","X","X","SINGLE","XB-Only","DVR (800) Crossband/No Inband; For APX (VHF+UHF+700+800) using Single-Band Antenna(s)",4,15,3,0,1356,2,3,"8J087X51-57",""]
[null,null,null,null,"QA09445AA",null,null,null,null,800,"X","X","X","X","ALL","XB-Only","DVR (800) Crossband/No Inband; For APX (VHF+UHF+700+800) using One All-Band Antenna",4,15,3,1,1357,0,3,"8J087X51-39",""]
[null,null,null,null,"QA09445AA",null,null,null,null,800,"X","X","X","X","USER","XB-Only","DVR (800) Crossband/No Inband; For APX (VHF+UHF+700+800) using Unknown or User-Defined Antenna",4,15,3,2,1358,0,3,"No Drawing",""]
[null,"X",null,null,null,"X",null,null,null,800,"X","X","X","X","SINGLE","IB+XB","DVR (800) Inband & Crossband; For APX (VHF+UHF+700+800) using Single-Band Antenna(s)",4,15,5,0,1362,8,3,"No Drawing",""]
[null,null,null,"QA09448AA",null,"X",null,null,null,800,"X","X","X","X","ALL","IB+XB","DVR (800) Inband & Crossband; For APX (VHF+UHF+700+800) using One All-Band Antenna",4,15,5,1,1363,6,3,"8J087X51-36",""]
[null,null,null,"QA09448AA",null,"X",null,null,null,800,"X","X","X","X","USER","IB+XB","DVR (800) Inband & Crossband; For APX (VHF+UHF+700+800) using Unknown or User-Defined Antenna",4,15,5,2,1364,6,3,"No Drawing",""]

{"sheet":"DVR SOLUTIONS","index":5,"n_rows":402,"n_cols":26,"rows_kept":402,"cut":false,"hidden":true,"merged":[[2,6,2,7]]}
[null,null,null,null,null,null,null,null,"DVR FILTERING CONFIGURATOR"]
["SOLUTIONS REQUIRED"]
[null,"Kit-1","Kit-2","Kit-3","KIT-4","KIT-0","Kit-5",null,"DVR",null,null,null,null,null,null,null,null,"Lookup/Sorting Codes",null,null,null,null,"FilterCode"]
[1,2,3,4,5,6," ",10,null,"DVR","MSU FREQUENCY BANDS USED",null,null,null,"MSU "]
[null,"TRIPLEXER SOLUTION",null,null,null,"STANDARD","OPTION","Required","NOTES","BAND","b1","b2","b3a","b3b","ANT","REPEAT",null,4,16,4,2]
["NONE","1x","1x+Relay","2x","2x+Relay","In-BAND","Relay","Relay","NOTES","DVR ","VHF","UHF",700,800,"MSU-Ant","TYPE","DESCRIPTION","VRF","MRF","RPT","ANT","TOTAl","FL","NumBands","Drawing"]
["X",null,null,null,null,"X",null,null,null,"VHF","X",null,null,null,"SINGLE","IB-Forced",{"$f":"$J$6&\"(\"&$J7&\")\"&\" \"&VLOOKUP($P7,RPTCodes,2,FALSE) &\"; For APX (\"&VLOOKUP($S7,BAND_NAMES,2)&\") using \"&VLOOKUP($O7,ANTcodes,3,FALSE)","v":"DVR (VHF) Inband; For APX (VHF) using Single-Band Antenna(s)"},{"$f":"VLOOKUP(J7,Freq_Bands,2)","v":1},{"$f":"IF(K7=\"X\",1,0)+IF(L7=\"X\",2,0)+IF(M7=\"X\",4,0)+IF(N7=\"X\",8,0)","v":1},{"$f":"VLOOKUP(P7,RPTCodes,4,FALSE)","v":2},{"$f":"VLOOKUP(O7,ANTcodes,2,FALSE)","v":0},{"$f":"$U7*MULT_ANT+$T7*MULT_RPT+$S7*MULT_MRF+$R7*MULT_VRF","v":296},{"$f":"IF($A7=\"X\",1,0)+IF($B7=\"X\",2,0)+IF($C7=\"X\",3,0)+IF($D7=\"X\",4,0)+IF($E7=\"X\",5,0)+IF($F7=\"X\",6,0)+IF($H7=\"X\",10,0)","v":7},{"$f":"COUNTA(K7:L7)+IF(RIGHT(M7&N7,1)=\"X\",1,0)","v":1},"No Drawing",{"$f":"IF(COUNTIF($A7:$H7, \"<>\"&\"\")=0,\"INVALID COMBO\",\"\")","v":""}]
["X",null,null,null,null,"X",null,null,null,"VHF","X",null,null,null,"ALL","IB-Forced","DVR (VHF) Inband; For APX (VHF) using One All-Band Antenna",1,1,2,1,297,7,1,"No Drawing",""]
["X",null,null,null,null,"X",null,null,null,"VHF","X",null,null,null,"USER","IB-Forced","DVR (VHF) Inband; For APX (VHF) using Unknown or User-Defined Antenna",1,1,2,2,298,7,1,"No Drawing",""]
[null,null,null,null,null,null,null,null,"INVALID COMBO","VHF","X",null,null,null,"SINGLE","XB-Only","DVR (VHF) Crossband/No Inband; For APX (VHF) using Single-Band Antenna(s)",1,1,3,0,299,0,1,"No Drawing","INVALID COMBO"]
[null,null,null,null,null,null,null,null,"INVALID COMBO","VHF","X",null,null,null,"ALL","XB-Only","DVR (VHF) Crossband/No Inband; For APX (VHF) using One All-Band Antenna",1,1,3,1,300,0,1,"No Drawing","INVALID COMBO"]
[null,null,null,null,null,null,null,null,"INVALID COMBO","VHF","X",null,null,null,"USER","XB-Only","DVR (VHF) Crossband/No Inband; For APX (VHF) using Unknown or User-Defined Antenna",1,1,3,2,301,0,1,"No Drawing","INVALID COMBO"]
[null,"X",null,null,null,null,null,null,null,"VHF",null,"X",null,null,"SINGLE","XB-Forced","DVR (VHF) Crossband; For APX (UHF) using Single-Band Antenna(s)",1,2,4,0,319,2,1,"No Drawing",""]
[null,"X",null,null,null,null,null,null,null,"VHF",null,"X",null,null,"ALL","XB-Forced","DVR (VHF) Crossband; For APX (UHF) using One All-Band Antenna",1,2,4,1,320,2,1,"No Drawing",""]
[null,"X",null,null,null,null,null,null,null,"VHF",null,"X",null,null,"USER","XB-Forced","DVR (VHF) Crossband; For APX (UHF) using Unknown or User-Defined Antenna",1,2,4,2,321,2,1,"No Drawing",""]
[null,"X",null,null,null,"X",null,null,null,"VHF","X","X",null,null,"SINGLE","IB-Only","DVR (VHF) Inband/No Crossband; For APX (VHF+UHF) using Single-Band Antenna(s)",1,3,1,0,327,8,2,"No Drawing",""]
[null,null,null,null,null,"X",null,null,null,"VHF","X","X",null,null,"ALL","IB-Only","DVR (VHF) Inband/No Crossband; For APX (VHF+UHF) using One All-Band Antenna",1,3,1,1,328,6,2,"No Drawing",""]
[null,null,null,null,null,"X",null,null,null,"VHF","X","X",null,null,"USER","IB-Only","DVR (VHF) Inband/No Crossband; For APX (VHF+UHF) using Unknown or User-Defined Antenna",1,3,1,2,329,6,2,"No Drawing",""]
[null,"X",null,null,null,null,null,"X",null,"VHF","X","X",null,null,"SINGLE","XB-Only","DVR (VHF) Crossband/No Inband; For APX (VHF+UHF) using Single-Band Antenna(s)",1,3,3,0,333,12,2,"8J087X51-43",""]
[null,null,"X",null,null,null,null,null,null,"VHF","X","X",null,null,"ALL","XB-Only","DVR (VHF) Crossband/No Inband; For APX (VHF+UHF) using One All-Band Antenna",1,3,3,1,334,3,2,"8J087X51-01",""]
[null,null,"X",null,null,null,null,null,null,"VHF","X","X",null,null,"USER","XB-Only","DVR (VHF) Crossband/No Inband; For APX (VHF+UHF) using Unknown or User-Defined Antenna",1,3,3,2,335,3,2,"No Drawing",""]
[null,"X",null,null,null,"X",null,null,null,"VHF","X","X",null,null,"SINGLE","IB+XB","DVR (VHF) Inband & Crossband; For APX (VHF+UHF) using Single-Band Antenna(s)",1,3,5,0,339,8,2,"No Drawing",""]
[null,null,null,"X",null,"X",null,null,null,"VHF","X","X",null,null,"ALL","IB+XB","DVR (VHF) Inband & Crossband; For APX (VHF+UHF) using One All-Band Antenna",1,3,5,1,340,10,2,"8J087X51-25",""]
[null,null,null,"X",null,"X",null,null,null,"VHF","X","X",null,null,"USER","IB+XB","DVR (VHF) Inband & Crossband; For APX (VHF+UHF) using Unknown or User-Defined Antenna",1,3,5,2,341,10,2,"No Drawing",""]
[null,"X",null,null,null,null,null,null,null,"VHF",null,null,"X",null,"SINGLE","XB-Forced","DVR (VHF) Crossband; For APX (700) using Single-Band Antenna(s)",1,4,4,0,353,2,1,"No Drawing",""]
[null,"X",null,null,null,null,null,null,null,"VHF",null,null,"X",null,"ALL","XB-Forced","DVR (VHF) Crossband; For APX (700) using One All-Band Antenna",1,4,4,1,354,2,1,"No Drawing",""]
[null,"X",null,null,null,null,null,null,null,"VHF",null,null,"X",null,"USER","XB-Forced","DVR (VHF) Crossband; For APX (700) using Unknown or User-Defined Antenna",1,4,4,2,355,2,1,"No Drawing",""]
[null,"X",null,null,null,"X",null,null,null,"VHF","X",null,"X",null,"SINGLE","IB-Only","DVR (VHF) Inband/No Crossband; For APX (VHF+700) using Single-Band Antenna(s)",1,5,1,0,361,8,2,"No Drawing",""]
[null,null,null,null,null,"X",null,null,null,"VHF","X",null,"X",null,"ALL","IB-Only","DVR (VHF) Inband/No Crossband; For APX (VHF+700) using One All-Band Antenna",1,5,1,1,362,6,2,"No Drawing",""]
[null,null,null,null,null,"X",null,null,null,"VHF","X",null,"X",null,"USER","IB-Only","DVR (VHF) Inband/No Crossband; For APX (VHF+700) using Unknown or User-Defined Antenna",1,5,1,2,363,6,2,"No Drawing",""]
[null,"X",null,null,null,null,null,"X",null,"VHF","X",null,"X",null,"SINGLE","XB-Only","DVR (VHF) Crossband/No Inband; For APX (VHF+700) using Single-Band Antenna(s)",1,5,3,0,367,12,2,"8J087X51-44",""]
[null,null,"X",null,null,null,null,null,null,"VHF","X",null,"X",null,"ALL","XB-Only","DVR (VHF) Crossband/No Inband; For APX (VHF+700) using One All-Band Antenna",1,5,3,1,368,3,2,"8J087X51-02",""]
[null,null,"X",null,null,null,null,null,null,"VHF","X",null,"X",null,"USER","XB-Only","DVR (VHF) Crossband/No Inband; For APX (VHF+700) using Unknown or User-Defined Antenna",1,5,3,2,369,3,2,"No Drawing",""]
[null,"X",null,null,null,"X",null,null,null,"VHF","X",null,"X",null,"SINGLE","IB+XB","DVR (VHF) Inband & Crossband; For APX (VHF+700) using Single-Band Antenna(s)",1,5,5,0,373,8,2,"No Drawing",""]
[null,null,null,"X",null,"X",null,null,null,"VHF","X",null,"X",null,"ALL","IB+XB","DVR (VHF) Inband & Crossband; For APX (VHF+700) using One All-Band Antenna",1,5,5,1,374,10,2,"8J087X51-26",""]
[null,null,null,"X",null,"X",null,null,null,"VHF","X",null,"X",null,"USER","IB+XB","DVR (VHF) Inband & Crossband; For APX (VHF+700) using Unknown or User-Defined Antenna",1,5,5,2,375,10,2,"No Drawing",""]
[null,"X",null,null,null,null,null,null,null,"VHF",null,"X","X",null,"SINGLE","XB-Forced","DVR (VHF) Crossband; For APX (UHF+700) using Single-Band Antenna(s)",1,6,4,0,387,2,2,"No Drawing",""]
[null,null,null,"X",null,null,null,null,null,"VHF",null,"X","X",null,"ALL","XB-Forced","DVR (VHF) Crossband; For APX (UHF+700) using One All-Band Antenna",1,6,4,1,388,4,2,"8J087X51-16",""]
[null,null,null,"X",null,null,null,null,null,"VHF",null,"X","X",null,"USER","XB-Forced","DVR (VHF) Crossband; For APX (UHF+700) using Unknown or User-Defined Antenna",1,6,4,2,389,4,2,"No Drawing",""]
[null,"X",null,null,null,"X",null,null,null,"VHF","X","X","X",null,"SINGLE","IB-Only","DVR (VHF) Inband/No Crossband; For APX (VHF+UHF+700) using Single-Band Antenna(s)",1,7,1,0,395,8,3,"No Drawing",""]
[null,null,null,null,null,"X",null,null,null,"VHF","X","X","X",null,"ALL","IB-Only","DVR (VHF) Inband/No Crossband; For APX (VHF+UHF+700) using One All-Band Antenna",1,7,1,1,396,6,3,"No Drawing",""]
[null,null,null,null,null,"X",null,null,null,"VHF","X","X","X",null,"USER","IB-Only","DVR (VHF) Inband/No Crossband; For APX (VHF+UHF+700) using Unknown or User-Defined Antenna",1,7,1,2,397,6,3,"No Drawing",""]
[null,"X",null,null,null,null,null,"X",null,"VHF","X","X","X",null,"SINGLE","XB-Only","DVR (VHF) Crossband/No Inband; For APX (VHF+UHF+700) using Single-Band Antenna(s)",1,7,3,0,401,12,3,"8J087X51-55",""]
[null,null,null,null,"X",null,null,null,null,"VHF","X","X","X",null,"ALL","XB-Only","DVR (VHF) Crossband/No Inband; For APX (VHF+UHF+700) using One All-Band Antenna",1,7,3,1,402,5,3,"8J087X51-37",""]
[null,null,null,null,"X",null,null,null,null,"VHF","X","X","X",null,"USER","XB-Only","DVR (VHF) Crossband/No Inband; For APX (VHF+UHF+700) using Unknown or User-Defined Antenna",1,7,3,2,403,5,3,"No Drawing",""]
[null,"X",null,null,null,"X",null,null,null,"VHF","X","X","X",null,"SINGLE","IB+XB","DVR (VHF) Inband & Crossband; For APX (VHF+UHF+700) using Single-Band Antenna(s)",1,7,5,0,407,8,3,"No Drawing",""]
[null,null,null,"X",null,"X",null,null,null,"VHF","X","X","X",null,"ALL","IB+XB","DVR (VHF) Inband & Crossband; For APX (VHF+UHF+700) using One All-Band Antenna",1,7,5,1,408,10,3,"8J087X51-34",""]
[null,null,null,"X",null,"X",null,null,null,"VHF","X","X","X",null,"USER","IB+XB","DVR (VHF) Inband & Crossband; For APX (VHF+UHF+700) using Unknown or User-Defined Antenna",1,7,5,2,409,10,3,"No Drawing",""]
[null,"X",null,null,null,null,null,null,null,"VHF",null,null,null,"X","SINGLE","XB-Forced","DVR (VHF) Crossband; For APX (800) using Single-Band Antenna(s)",1,8,4,0,421,2,1,"No Drawing",""]
[null,"X",null,null,null,null,null,null,null,"VHF",null,null,null,"X","ALL","XB-Forced","DVR (VHF) Crossband; For APX (800) using One All-Band Antenna",1,8,4,1,422,2,1,"No Drawing",""]
[null,"X",null,null,null,null,null,null,null,"VHF",null,null,null,"X","USER","XB-Forced","DVR (VHF) Crossband; For APX (800) using Unknown or User-Defined Antenna",1,8,4,2,423,2,1,"No Drawing",""]
[null,"X",null,null,null,"X",null,null,null,"VHF","X",null,null,"X","SINGLE","IB-Only","DVR (VHF) Inband/No Crossband; For APX (VHF+800) using Single-Band Antenna(s)",1,9,1,0,429,8,2,"No Drawing",""]
[null,null,null,null,null,"X",null,null,null,"VHF","X",null,null,"X","ALL","IB-Only","DVR (VHF) Inband/No Crossband; For APX (VHF+800) using One All-Band Antenna",1,9,1,1,430,6,2,"No Drawing",""]
[null,null,null,null,null,"X",null,null,null,"VHF","X",null,null,"X","USER","IB-Only","DVR (VHF) Inband/No Crossband; For APX (VHF+800) using Unknown or User-Defined Antenna",1,9,1,2,431,6,2,"No Drawing",""]
[null,"X",null,null,null,null,null,"X",null,"VHF","X",null,null,"X","SINGLE","XB-Only","DVR (VHF) Crossband/No Inband; For APX (VHF+800) using Single-Band Antenna(s)",1,9,3,0,435,12,2,"8J087X51-44",""]
[null,null,"X",null,null,null,null,null,null,"VHF","X",null,null,"X","ALL","XB-Only","DVR (VHF) Crossband/No Inband; For APX (VHF+800) using One All-Band Antenna",1,9,3,1,436,3,2,"8J087X51-02",""]
[null,null,"X",null,null,null,null,null,null,"VHF","X",null,null,"X","USER","XB-Only","DVR (VHF) Crossband/No Inband; For APX (VHF+800) using Unknown or User-Defined Antenna",1,9,3,2,437,3,2,"No Drawing",""]
[null,"X",null,null,null,"X",null,null,null,"VHF","X",null,null,"X","SINGLE","IB+XB","DVR (VHF) Inband & Crossband; For APX (VHF+800) using Single-Band Antenna(s)",1,9,5,0,441,8,2,"No Drawing",""]
[null,null,null,"X",null,"X",null,null,null,"VHF","X",null,null,"X","ALL","IB+XB","DVR (VHF) Inband & Crossband; For APX (VHF+800) using One All-Band Antenna",1,9,5,1,442,10,2,"8J087X51-26",""]
[null,null,null,"X",null,"X",null,null,null,"VHF","X",null,null,"X","USER","IB+XB","DVR (VHF) Inband & Crossband; For APX (VHF+800) using Unknown or User-Defined Antenna",1,9,5,2,443,10,2,"No Drawing",""]
[null,"X",null,null,null,null,null,null,null,"VHF",null,"X",null,"X","SINGLE","XB-Forced","DVR (VHF) Crossband; For APX (UHF+800) using Single-Band Antenna(s)",1,10,4,0,455,2,2,"No Drawing",""]
[null,null,null,"X",null,null,null,null,null,"VHF",null,"X",null,"X","ALL","XB-Forced","DVR (VHF) Crossband; For APX (UHF+800) using One All-Band Antenna",1,10,4,1,456,4,2,"8J087X51-16",""]
[null,null,null,"X",null,null,null,null,null,"VHF",null,"X",null,"X","USER","XB-Forced","DVR (VHF) Crossband; For APX (UHF+800) using Unknown or User-Defined Antenna",1,10,4,2,457,4,2,"No Drawing",""]
[null,"X",null,null,null,"X",null,null,null,"VHF","X","X",null,"X","SINGLE","IB-Only","DVR (VHF) Inband/No Crossband; For APX (VHF+UHF+800) using Single-Band Antenna(s)",1,11,1,0,463,8,3,"No Drawing",""]
[null,null,null,null,null,"X",null,null,null,"VHF","X","X",null,"X","ALL","IB-Only","DVR (VHF) Inband/No Crossband; For APX (VHF+UHF+800) using One All-Band Antenna",1,11,1,1,464,6,3,"No Drawing",""]
[null,null,null,null,null,"X",null,null,null,"VHF","X","X",null,"X","USER","IB-Only","DVR (VHF) Inband/No Crossband; For APX (VHF+UHF+800) using Unknown or User-Defined Antenna",1,11,1,2,465,6,3,"No Drawing",""]
[null,"X",null,null,null,null,null,"X",null,"VHF","X","X",null,"X","SINGLE","XB-Only","DVR (VHF) Crossband/No Inband; For APX (VHF+UHF+800) using Single-Band Antenna(s)",1,11,3,0,469,12,3,"8J087X51-55",""]
[null,null,null,null,"X",null,null,null,null,"VHF","X","X",null,"X","ALL","XB-Only","DVR (VHF) Crossband/No Inband; For APX (VHF+UHF+800) using One All-Band Antenna",1,11,3,1,470,5,3,"8J087X51-37",""]
[null,null,null,null,"X",null,null,null,null,"VHF","X","X",null,"X","USER","XB-Only","DVR (VHF) Crossband/No Inband; For APX (VHF+UHF+800) using Unknown or User-Defined Antenna",1,11,3,2,471,5,3,"No Drawing",""]
[null,"X",null,null,null,"X",null,null,null,"VHF","X","X",null,"X","SINGLE","IB+XB","DVR (VHF) Inband & Crossband; For APX (VHF+UHF+800) using Single-Band Antenna(s)",1,11,5,0,475,8,3,"No Drawing",""]
[null,null,null,"X",null,"X",null,null,null,"VHF","X","X",null,"X","ALL","IB+XB",{"$f":"$J$6&\"(\"&$J71&\")\"&\" \"&VLOOKUP($P71,RPTCodes,2,FALSE) &\"; For APX (\"&VLOOKUP($S71,BAND_NAMES,2)&\") using \"&VLOOKUP($O71,ANTcodes,3,FALSE)","v":"DVR (VHF) Inband & Crossband; For APX (VHF+UHF+800) using One All-Band Antenna"},{"$f":"VLOOKUP(J71,Freq_Bands,2)","v":1},{"$f":"IF(K71=\"X\",1,0)+IF(L71=\"X\",2,0)+IF(M71=\"X\",4,0)+IF(N71=\"X\",8,0)","v":11},{"$f":"VLOOKUP(P71,RPTCodes,4,FALSE)","v":5},{"$f":"VLOOKUP(O71,ANTcodes,2,FALSE)","v":1},{"$f":"$U71*MULT_ANT+$T71*MULT_RPT+$S71*MULT_MRF+$R71*MULT_VRF","v":476},{"$f":"IF($A71=\"X\",1,0)+IF($B71=\"X\",2,0)+IF($C71=\"X\",3,0)+IF($D71=\"X\",4,0)+IF($E71=\"X\",5,0)+IF($F71=\"X\",6,0)+IF($H71=\"X\",10,0)","v":10},{"$f":"COUNTA(K71:L71)+IF(RIGHT(M71&N71,1)=\"X\",1,0)","v":3},"8J087X51-34",{"$f":"IF(COUNTIF($A71:$H71, \"<>\"&\"\")=0,\"INVALID COMBO\",\"\")","v":""}]
[null,null,null,"X",null,"X",null,null,null,"VHF","X","X",null,"X","USER","IB+XB","DVR (VHF) Inband & Crossband; For APX (VHF+UHF+800) using Unknown or User-Defined Antenna",1,11,5,2,477,10,3,"No Drawing",""]
[null,"X",null,null,null,null,null,null,null,"VHF",null,null,"X","X","SINGLE","XB-Forced","DVR (VHF) Crossband; For APX (700+800) using Single-Band Antenna(s)",1,12,4,0,489,2,1,"No Drawing",""]
[null,"X",null,null,null,null,null,null,null,"VHF",null,null,"X","X","ALL","XB-Forced","DVR (VHF) Crossband; For APX (700+800) using One All-Band Antenna",1,12,4,1,490,2,1,"No Drawing",""]
[null,"X",null,null,null,null,null,null,null,"VHF",null,null,"X","X","USER","XB-Forced","DVR (VHF) Crossband; For APX (700+800) using Unknown or User-Defined Antenna",1,12,4,2,491,2,1,"No Drawing",""]
[null,"X",null,null,null,"X",null,null,null,"VHF","X",null,"X","X","SINGLE","IB-Only","DVR (VHF) Inband/No Crossband; For APX (VHF+700+800) using Single-Band Antenna(s)",1,13,1,0,497,8,2,"No Drawing",""]
[null,null,null,null,null,"X",null,null,null,"VHF","X",null,"X","X","ALL","IB-Only","DVR (VHF) Inband/No Crossband; For APX (VHF+700+800) using One All-Band Antenna",1,13,1,1,498,6,2,"No Drawing",""]
[null,null,null,null,null,"X",null,null,null,"VHF","X",null,"X","X","USER","IB-Only","DVR (VHF) Inband/No Crossband; For APX (VHF+700+800) using Unknown or User-Defined Antenna",1,13,1,2,499,6,2,"No Drawing",""]
[null,"X",null,null,null,null,null,"X",null,"VHF","X",null,"X","X","SINGLE","XB-Only","DVR (VHF) Crossband/No Inband; For APX (VHF+700+800) using Single-Band Antenna(s)",1,13,3,0,503,12,2,"8J087X51-44",""]
[null,null,"X",null,null,null,null,null,null,"VHF","X",null,"X","X","ALL","XB-Only","DVR (VHF) Crossband/No Inband; For APX (VHF+700+800) using One All-Band Antenna",1,13,3,1,504,3,2,"8J087X51-02",""]
[null,null,"X",null,null,null,null,null,null,"VHF","X",null,"X","X","USER","XB-Only","DVR (VHF) Crossband/No Inband; For APX (VHF+700+800) using Unknown or User-Defined Antenna",1,13,3,2,505,3,2,"No Drawing",""]
[null,"X",null,null,null,"X",null,null,null,"VHF","X",null,"X","X","SINGLE","IB+XB","DVR (VHF) Inband & Crossband; For APX (VHF+700+800) using Single-Band Antenna(s)",1,13,5,0,509,8,2,"No Drawing",""]
[null,null,null,"X",null,"X",null,null,null,"VHF","X",null,"X","X","ALL","IB+XB","DVR (VHF) Inband & Crossband; For APX (VHF+700+800) using One All-Band Antenna",1,13,5,1,510,10,2,"8J087X51-26",""]
[null,null,null,"X",null,"X",null,null,null,"VHF","X",null,"X","X","USER","IB+XB","DVR (VHF) Inband & Crossband; For APX (VHF+700+800) using Unknown or User-Defined Antenna",1,13,5,2,511,10,2,"No Drawing",""]
[null,"X",null,null,null,null,null,null,null,"VHF",null,"X","X","X","SINGLE","XB-Forced","DVR (VHF) Crossband; For APX (UHF+700+800) using Single-Band Antenna(s)",1,14,4,0,523,2,2,"No Drawing",""]
[null,null,null,"X",null,null,null,null,null,"VHF",null,"X","X","X","ALL","XB-Forced","DVR (VHF) Crossband; For APX (UHF+700+800) using One All-Band Antenna",1,14,4,1,524,4,2,"8J087X51-16",""]
[null,null,null,"X",null,null,null,null,null,"VHF",null,"X","X","X","USER","XB-Forced","DVR (VHF) Crossband; For APX (UHF+700+800) using Unknown or User-Defined Antenna",1,14,4,2,525,4,2,"No Drawing",""]
[null,"X",null,null,null,"X",null,null,null,"VHF","X","X","X","X","SINGLE","IB-Only","DVR (VHF) Inband/No Crossband; For APX (VHF+UHF+700+800) using Single-Band Antenna(s)",1,15,1,0,531,8,3,"No Drawing",""]
[null,null,null,null,null,"X",null,null,null,"VHF","X","X","X","X","ALL","IB-Only","DVR (VHF) Inband/No Crossband; For APX (VHF+UHF+700+800) using One All-Band Antenna",1,15,1,1,532,6,3,"No Drawing",""]
[null,null,null,null,null,"X",null,null,null,"VHF","X","X","X","X","USER","IB-Only","DVR (VHF) Inband/No Crossband; For APX (VHF+UHF+700+800) using Unknown or User-Defined Antenna",1,15,1,2,533,6,3,"No Drawing",""]
[null,"X",null,null,null,null,null,"X",null,"VHF","X","X","X","X","SINGLE","XB-Only","DVR (VHF) Crossband/No Inband; For APX (VHF+UHF+700+800) using Single-Band Antenna(s)",1,15,3,0,537,12,3,"8J087X51-55",""]
[null,null,null,null,"X",null,null,null,null,"VHF","X","X","X","X","ALL","XB-Only","DVR (VHF) Crossband/No Inband; For APX (VHF+UHF+700+800) using One All-Band Antenna",1,15,3,1,538,5,3,"8J087X51-37",""]
[null,null,null,null,"X",null,null,null,null,"VHF","X","X","X","X","USER","XB-Only","DVR (VHF) Crossband/No Inband; For APX (VHF+UHF+700+800) using Unknown or User-Defined Antenna",1,15,3,2,539,5,3,"No Drawing",""]
[null,"X",null,null,null,"X",null,null,null,"VHF","X","X","X","X","SINGLE","IB+XB","DVR (VHF) Inband & Crossband; For APX (VHF+UHF+700+800) using Single-Band Antenna(s)",1,15,5,0,543,8,3,"No Drawing",""]
[null,null,null,"X",null,"X",null,null,null,"VHF","X","X","X","X","ALL","IB+XB","DVR (VHF) Inband & Crossband; For APX (VHF+UHF+700+800) using One All-Band Antenna",1,15,5,1,544,10,3,"8J087X51-34",""]
[null,null,null,"X",null,"X",null,null,null,"VHF","X","X","X","X","USER","IB+XB","DVR (VHF) Inband & Crossband; For APX (VHF+UHF+700+800) using Unknown or User-Defined Antenna",1,15,5,2,545,10,3,"No Drawing",""]
[null,"X",null,null,null,null,null,null,null,"UHF","X",null,null,null,"SINGLE","XB-Forced","DVR (UHF) Crossband; For APX (VHF) using Single-Band Antenna(s)",2,1,4,0,575,2,1,"No Drawing",""]
[null,"X",null,null,null,null,null,null,null,"UHF","X",null,null,null,"ALL","XB-Forced","DVR (UHF) Crossband; For APX (VHF) using One All-Band Antenna",2,1,4,1,576,2,1,"No Drawing",""]
[null,"X",null,null,null,null,null,null,null,"UHF","X",null,null,null,"USER","XB-Forced","DVR (UHF) Crossband; For APX (VHF) using Unknown or User-Defined Antenna",2,1,4,2,577,2,1,"No Drawing",""]
["X",null,null,null,null,"X",null,null,null,"UHF",null,"X",null,null,"SINGLE","IB-Forced","DVR (UHF) Inband; For APX (UHF) using Single-Band Antenna(s)",2,2,2,0,586,7,1,"No Drawing",""]
["X",null,null,null,null,"X",null,null,null,"UHF",null,"X",null,null,"ALL","IB-Forced","DVR (UHF) Inband; For APX (UHF) using One All-Band Antenna",2,2,2,1,587,7,1,"No Drawing",""]
["X",null,null,null,null,"X",null,null,null,"UHF",null,"X",null,null,"USER","IB-Forced","DVR (UHF) Inband; For APX (UHF) using Unknown or User-Defined Antenna",2,2,2,2,588,7,1,"No Drawing",""]
[null,null,null,null,null,null,null,null,"INVALID COMBO","UHF",null,"X",null,null,"SINGLE","XB-Only","DVR (UHF) Crossband/No Inband; For APX (UHF) using Single-Band Antenna(s)",2,2,3,0,589,0,1,"No Drawing","INVALID COMBO"]
[null,null,null,null,null,null,null,null,"INVALID COMBO","UHF",null,"X",null,null,"ALL","XB-Only","DVR (UHF) Crossband/No Inband; For APX (UHF) using One All-Band Antenna",2,2,3,1,590,0,1,"No Drawing","INVALID COMBO"]
[null,null,null,null,null,null,null,null,"INVALID COMBO","UHF",null,"X",null,null,"USER","XB-Only","DVR (UHF) Crossband/No Inband; For APX (UHF) using Unknown or User-Defined Antenna",2,2,3,2,591,0,1,"No Drawing","INVALID COMBO"]
[null,"X",null,null,null,"X",null,null,null,"UHF","X","X",null,null,"SINGLE","IB-Only","DVR (UHF) Inband/No Crossband; For APX (VHF+UHF) using Single-Band Antenna(s)",2,3,1,0,600,8,2,"No Drawing",""]
[null,null,null,null,null,"X",null,null,null,"UHF","X","X",null,null,"ALL","IB-Only","DVR (UHF) Inband/No Crossband; For APX (VHF+UHF) using One All-Band Antenna",2,3,1,1,601,6,2,"No Drawing",""]
[null,null,null,null,null,"X",null,null,null,"UHF","X","X",null,null,"USER","IB-Only","DVR (UHF) Inband/No Crossband; For APX (VHF+UHF) using Unknown or User-Defined Antenna",2,3,1,2,602,6,2,"No Drawing",""]
[null,"X",null,null,null,null,null,"X",null,"UHF","X","X",null,null,"SINGLE","XB-Only","DVR (UHF) Crossband/No Inband; For APX (VHF+UHF) using Single-Band Antenna(s)",2,3,3,0,606,12,2,"8J087X51-45",""]
[null,null,"X",null,null,null,null,null,null,"UHF","X","X",null,null,"ALL","XB-Only","DVR (UHF) Crossband/No Inband; For APX (VHF+UHF) using One All-Band Antenna",2,3,3,1,607,3,2,"8J087X51-03",""]
[null,null,"X",null,null,null,null,null,null,"UHF","X","X",null,null,"USER","XB-Only","DVR (UHF) Crossband/No Inband; For APX (VHF+UHF) using Unknown or User-Defined Antenna",2,3,3,2,608,3,2,"No Drawing",""]
[null,"X",null,null,null,"X",null,null,null,"UHF","X","X",null,null,"SINGLE","IB+XB","DVR (UHF) Inband & Crossband; For APX (VHF+UHF) using Single-Band Antenna(s)",2,3,5,0,612,8,2,"No Drawing",""]
[null,null,null,"X",null,"X",null,null,null,"UHF","X","X",null,null,"ALL","IB+XB","DVR (UHF) Inband & Crossband; For APX (VHF+UHF) using One All-Band Antenna",2,3,5,1,613,10,2,"8J087X51-27",""]
[null,null,null,"X",null,"X",null,null,null,"UHF","X","X",null,null,"USER","IB+XB","DVR (UHF) Inband & Crossband; For APX (VHF+UHF) using Unknown or User-Defined Antenna",2,3,5,2,614,10,2,"No Drawing",""]
[null,"X",null,null,null,null,null,null,null,"UHF",null,null,"X",null,"SINGLE","XB-Forced","DVR (UHF) Crossband; For APX (700) using Single-Band Antenna(s)",2,4,4,0,626,2,1,"No Drawing",""]
[null,"X",null,null,null,null,null,null,null,"UHF",null,null,"X",null,"ALL","XB-Forced","DVR (UHF) Crossband; For APX (700) using One All-Band Antenna",2,4,4,1,627,2,1,"No Drawing",""]
[null,"X",null,null,null,null,null,null,null,"UHF",null,null,"X",null,"USER","XB-Forced","DVR (UHF) Crossband; For APX (700) using Unknown or User-Defined Antenna",2,4,4,2,628,2,1,"No Drawing",""]
[null,"X",null,null,null,null,null,null,null,"UHF","X",null,"X",null,"SINGLE","XB-Forced","DVR (UHF) Crossband; For APX (VHF+700) using Single-Band Antenna(s)",2,5,4,0,643,2,2,"No Drawing",""]
[null,null,null,"X",null,null,null,null,null,"UHF","X",null,"X",null,"ALL","XB-Forced","DVR (UHF) Crossband; For APX (VHF+700) using One All-Band Antenna",2,5,4,1,644,4,2,"8J087X51-17",""]
[null,null,null,"X",null,null,null,null,null,"UHF","X",null,"X",null,"USER","XB-Forced","DVR (UHF) Crossband; For APX (VHF+700) using Unknown or User-Defined Antenna",2,5,4,2,645,4,2,"No Drawing",""]
[null,"X",null,null,null,"X",null,null,null,"UHF",null,"X","X",null,"SINGLE","IB-Only","DVR (UHF) Inband/No Crossband; For APX (UHF+700) using Single-Band Antenna(s)",2,6,1,0,651,8,2,"No Drawing",""]
[null,null,null,null,null,"X",null,null,null,"UHF",null,"X","X",null,"ALL","IB-Only","DVR (UHF) Inband/No Crossband; For APX (UHF+700) using One All-Band Antenna",2,6,1,1,652,6,2,"No Drawing",""]
[null,null,null,null,null,"X",null,null,null,"UHF",null,"X","X",null,"USER","IB-Only","DVR (UHF) Inband/No Crossband; For APX (UHF+700) using Unknown or User-Defined Antenna",2,6,1,2,653,6,2,"No Drawing",""]
[null,"X",null,null,null,null,null,"X",null,"UHF",null,"X","X",null,"SINGLE","XB-Only","DVR (UHF) Crossband/No Inband; For APX (UHF+700) using Single-Band Antenna(s)",2,6,3,0,657,12,2,"8J087X51-46",""]
[null,null,"X",null,null,null,null,null,null,"UHF",null,"X","X",null,"ALL","XB-Only","DVR (UHF) Crossband/No Inband; For APX (UHF+700) using One All-Band Antenna",2,6,3,1,658,3,2,"8J087X51-04",""]
[null,null,"X",null,null,null,null,null,null,"UHF",null,"X","X",null,"USER","XB-Only","DVR (UHF) Crossband/No Inband; For APX (UHF+700) using Unknown or User-Defined Antenna",2,6,3,2,659,3,2,"No Drawing",""]
[null,"X",null,null,null,"X",null,null,null,"UHF",null,"X","X",null,"SINGLE","IB+XB","DVR (UHF) Inband & Crossband; For APX (UHF+700) using Single-Band Antenna(s)",2,6,5,0,663,8,2,"No Drawing",""]
[null,null,null,"X",null,"X",null,null,null,"UHF",null,"X","X",null,"ALL","IB+XB","DVR (UHF) Inband & Crossband; For APX (UHF+700) using One All-Band Antenna",2,6,5,1,664,10,2,"8J087X51-28",""]
[null,null,null,"X",null,"X",null,null,null,"UHF",null,"X","X",null,"USER","IB+XB","DVR (UHF) Inband & Crossband; For APX (UHF+700) using Unknown or User-Defined Antenna",2,6,5,2,665,10,2,"No Drawing",""]
[null,"X",null,null,null,"X",null,null,null,"UHF","X","X","X",null,"SINGLE","IB-Only","DVR (UHF) Inband/No Crossband; For APX (VHF+UHF+700) using Single-Band Antenna(s)",2,7,1,0,668,8,3,"No Drawing",""]
[null,null,null,null,null,"X",null,null,null,"UHF","X","X","X",null,"ALL","IB-Only","DVR (UHF) Inband/No Crossband; For APX (VHF+UHF+700) using One All-Band Antenna",2,7,1,1,669,6,3,"No Drawing",""]
[null,null,null,null,null,"X",null,null,null,"UHF","X","X","X",null,"USER","IB-Only","DVR (UHF) Inband/No Crossband; For APX (VHF+UHF+700) using Unknown or User-Defined Antenna",2,7,1,2,670,6,3,"No Drawing",""]
[null,"X",null,null,null,null,null,"X",null,"UHF","X","X","X",null,"SINGLE","XB-Only","DVR (UHF) Crossband/No Inband; For APX (VHF+UHF+700) using Single-Band Antenna(s)",2,7,3,0,674,12,3,"8J087X51-56",""]
[null,null,null,null,"X",null,null,null,null,"UHF","X","X","X",null,"ALL","XB-Only","DVR (UHF) Crossband/No Inband; For APX (VHF+UHF+700) using One All-Band Antenna",2,7,3,1,675,5,3,"8J087X51-38",""]
[null,null,null,null,"X",null,null,null,null,"UHF","X","X","X",null,"USER","XB-Only",{"$f":"$J$6&\"(\"&$J135&\")\"&\" \"&VLOOKUP($P135,RPTCodes,2,FALSE) &\"; For APX (\"&VLOOKUP($S135,BAND_NAMES,2)&\") using \"&VLOOKUP($O135,ANTcodes,3,FALSE)","v":"DVR (UHF) Crossband/No Inband; For APX (VHF+UHF+700) using Unknown or User-Defined Antenna"},{"$f":"VLOOKUP(J135,Freq_Bands,2)","v":2},{"$f":"IF(K135=\"X\",1,0)+IF(L135=\"X\",2,0)+IF(M135=\"X\",4,0)+IF(N135=\"X\",8,0)","v":7},{"$f":"VLOOKUP(P135,RPTCodes,4,FALSE)","v":3},{"$f":"VLOOKUP(O135,ANTcodes,2,FALSE)","v":2},{"$f":"$U135*MULT_ANT+$T135*MULT_RPT+$S135*MULT_MRF+$R135*MULT_VRF","v":676},{"$f":"IF($A135=\"X\",1,0)+IF($B135=\"X\",2,0)+IF($C135=\"X\",3,0)+IF($D135=\"X\",4,0)+IF($E135=\"X\",5,0)+IF($F135=\"X\",6,0)+IF($H135=\"X\",10,0)","v":5},{"$f":"COUNTA(K135:L135)+IF(RIGHT(M135&N135,1)=\"X\",1,0)","v":3},"No Drawing",{"$f":"IF(COUNTIF($A135:$H135, \"<>\"&\"\")=0,\"INVALID COMBO\",\"\")","v":""}]
[null,"X",null,null,null,"X",null,null,null,"UHF","X","X","X",null,"SINGLE","IB+XB","DVR (UHF) Inband & Crossband; For APX (VHF+UHF+700) using Single-Band Antenna(s)",2,7,5,0,680,8,3,"No Drawing",""]
[null,null,null,"X",null,"X",null,null,null,"UHF","X","X","X",null,"ALL","IB+XB","DVR (UHF) Inband & Crossband; For APX (VHF+UHF+700) using One All-Band Antenna",2,7,5,1,681,10,3,"8J087X51-35",""]
[null,null,null,"X",null,"X",null,null,null,"UHF","X","X","X",null,"USER","IB+XB","DVR (UHF) Inband & Crossband; For APX (VHF+UHF+700) using Unknown or User-Defined Antenna",2,7,5,2,682,10,3,"No Drawing",""]
[null,"X",null,null,null,null,null,null,null,"UHF",null,null,null,"X","SINGLE","XB-Forced","DVR (UHF) Crossband; For APX (800) using Single-Band Antenna(s)",2,8,4,0,694,2,1,"No Drawing",""]
[null,"X",null,null,null,null,null,null,null,"UHF",null,null,null,"X","ALL","XB-Forced","DVR (UHF) Crossband; For APX (800) using One All-Band Antenna",2,8,4,1,695,2,1,"No Drawing",""]
[null,"X",null,null,null,null,null,null,null,"UHF",null,null,null,"X","USER","XB-Forced","DVR (UHF) Crossband; For APX (800) using Unknown or User-Defined Antenna",2,8,4,2,696,2,1,"No Drawing",""]
[null,"X",null,null,null,null,null,null,null,"UHF","X",null,null,"X","SINGLE","XB-Forced","DVR (UHF) Crossband; For APX (VHF+800) using Single-Band Antenna(s)",2,9,4,0,711,2,2,"No Drawing",""]
[null,null,null,"X",null,null,null,null,null,"UHF","X",null,null,"X","ALL","XB-Forced","DVR (UHF) Crossband; For APX (VHF+800) using One All-Band Antenna",2,9,4,1,712,4,2,"8J087X51-17",""]
[null,null,null,"X",null,null,null,null,null,"UHF","X",null,null,"X","USER","XB-Forced","DVR (UHF) Crossband; For APX (VHF+800) using Unknown or User-Defined Antenna",2,9,4,2,713,4,2,"No Drawing",""]
[null,"X",null,null,null,"X",null,null,null,"UHF",null,"X",null,"X","SINGLE","IB-Only","DVR (UHF) Inband/No Crossband; For APX (UHF+800) using Single-Band Antenna(s)",2,10,1,0,719,8,2,"No Drawing",""]
[null,null,null,null,null,"X",null,null,null,"UHF",null,"X",null,"X","ALL","IB-Only","DVR (UHF) Inband/No Crossband; For APX (UHF+800) using One All-Band Antenna",2,10,1,1,720,6,2,"No Drawing",""]
[null,null,null,null,null,"X",null,null,null,"UHF",null,"X",null,"X","USER","IB-Only","DVR (UHF) Inband/No Crossband; For APX (UHF+800) using Unknown or User-Defined Antenna",2,10,1,2,721,6,2,"No Drawing",""]
[null,"X",null,null,null,null,null,"X",null,"UHF",null,"X",null,"X","SINGLE","XB-Only","DVR (UHF) Crossband/No Inband; For APX (UHF+800) using Single-Band Antenna(s)",2,10,3,0,725,12,2,"8J087X51-46",""]
[null,null,"X",null,null,null,null,null,null,"UHF",null,"X",null,"X","ALL","XB-Only","DVR (UHF) Crossband/No Inband; For APX (UHF+800) using One All-Band Antenna",2,10,3,1,726,3,2,"8J087X51-04",""]
[null,null,"X",null,null,null,null,null,null,"UHF",null,"X",null,"X","USER","XB-Only","DVR (UHF) Crossband/No Inband; For APX (UHF+800) using Unknown or User-Defined Antenna",2,10,3,2,727,3,2,"No Drawing",""]
[null,"X",null,null,null,"X",null,null,null,"UHF",null,"X",null,"X","SINGLE","IB+XB","DVR (UHF) Inband & Crossband; For APX (UHF+800) using Single-Band Antenna(s)",2,10,5,0,731,8,2,"No Drawing",""]
[null,null,null,"X",null,"X",null,null,null,"UHF",null,"X",null,"X","ALL","IB+XB","DVR (UHF) Inband & Crossband; For APX (UHF+800) using One All-Band Antenna",2,10,5,1,732,10,2,"8J087X51-28",""]
[null,null,null,"X",null,"X",null,null,null,"UHF",null,"X",null,"X","USER","IB+XB","DVR (UHF) Inband & Crossband; For APX (UHF+800) using Unknown or User-Defined Antenna",2,10,5,2,733,10,2,"No Drawing",""]
[null,"X",null,null,null,"X",null,null,null,"UHF","X","X",null,"X","SINGLE","IB-Only","DVR (UHF) Inband/No Crossband; For APX (VHF+UHF+800) using Single-Band Antenna(s)",2,11,1,0,736,8,3,"No Drawing",""]
[null,null,null,null,null,"X",null,null,null,"UHF","X","X",null,"X","ALL","IB-Only","DVR (UHF) Inband/No Crossband; For APX (VHF+UHF+800) using One All-Band Antenna",2,11,1,1,737,6,3,"No Drawing",""]
[null,null,null,null,null,"X",null,null,null,"UHF","X","X",null,"X","USER","IB-Only","DVR (UHF) Inband/No Crossband; For APX (VHF+UHF+800) using Unknown or User-Defined Antenna",2,11,1,2,738,6,3,"No Drawing",""]
[null,"X",null,null,null,null,null,"X",null,"UHF","X","X",null,"X","SINGLE","XB-Only","DVR (UHF) Crossband/No Inband; For APX (VHF+UHF+800) using Single-Band Antenna(s)",2,11,3,0,742,12,3,"8J087X51-56",""]
[null,null,null,null,"X",null,null,null,null,"UHF","X","X",null,"X","ALL","XB-Only","DVR (UHF) Crossband/No Inband; For APX (VHF+UHF+800) using One All-Band Antenna",2,11,3,1,743,5,3,"8J087X51-38",""]
[null,null,null,null,"X",null,null,null,null,"UHF","X","X",null,"X","USER","XB-Only","DVR (UHF) Crossband/No Inband; For APX (VHF+UHF+800) using Unknown or User-Defined Antenna",2,11,3,2,744,5,3,"No Drawing",""]
[null,"X",null,null,null,"X",null,null,null,"UHF","X","X",null,"X","SINGLE","IB+XB","DVR (UHF) Inband & Crossband; For APX (VHF+UHF+800) using Single-Band Antenna(s)",2,11,5,0,748,8,3,"No Drawing",""]
[null,null,null,"X",null,"X",null,null,null,"UHF","X","X",null,"X","ALL","IB+XB","DVR (UHF) Inband & Crossband; For APX (VHF+UHF+800) using One All-Band Antenna",2,11,5,1,749,10,3,"8J087X51-35",""]
[null,null,null,"X",null,"X",null,null,null,"UHF","X","X",null,"X","USER","IB+XB","DVR (UHF) Inband & Crossband; For APX (VHF+UHF+800) using Unknown or User-Defined Antenna",2,11,5,2,750,10,3,"No Drawing",""]
[null,"X",null,null,null,null,null,null,null,"UHF",null,null,"X","X","SINGLE","XB-Forced","DVR (UHF) Crossband; For APX (700+800) using Single-Band Antenna(s)",2,12,4,0,762,2,1,"No Drawing",""]
[null,"X",null,null,null,null,null,null,null,"UHF",null,null,"X","X","ALL","XB-Forced","DVR (UHF) Crossband; For APX (700+800) using One All-Band Antenna",2,12,4,1,763,2,1,"No Drawing",""]
[null,"X",null,null,null,null,null,null,null,"UHF",null,null,"X","X","USER","XB-Forced","DVR (UHF) Crossband; For APX (700+800) using Unknown or User-Defined Antenna",2,12,4,2,764,2,1,"No Drawing",""]
[null,"X",null,null,null,null,null,null,null,"UHF","X",null,"X","X","SINGLE","XB-Forced","DVR (UHF) Crossband; For APX (VHF+700+800) using Single-Band Antenna(s)",2,13,4,0,779,2,2,"No Drawing",""]
[null,null,null,"X",null,null,null,null,null,"UHF","X",null,"X","X","ALL","XB-Forced","DVR (UHF) Crossband; For APX (VHF+700+800) using One All-Band Antenna",2,13,4,1,780,4,2,"8J087X51-17",""]
[null,null,null,"X",null,null,null,null,null,"UHF","X",null,"X","X","USER","XB-Forced","DVR (UHF) Crossband; For APX (VHF+700+800) using Unknown or User-Defined Antenna",2,13,4,2,781,4,2,"No Drawing",""]
[null,"X",null,null,null,"X",null,null,null,"UHF",null,"X","X","X","SINGLE","IB-Only","DVR (UHF) Inband/No Crossband; For APX (UHF+700+800) using Single-Band Antenna(s)",2,14,1,0,787,8,2,"No Drawing",""]
[null,null,null,null,null,"X",null,null,null,"UHF",null,"X","X","X","ALL","IB-Only","DVR (UHF) Inband/No Crossband; For APX (UHF+700+800) using One All-Band Antenna",2,14,1,1,788,6,2,"No Drawing",""]
[null,null,null,null,null,"X",null,null,null,"UHF",null,"X","X","X","USER","IB-Only","DVR (UHF) Inband/No Crossband; For APX (UHF+700+800) using Unknown or User-Defined Antenna",2,14,1,2,789,6,2,"No Drawing",""]
[null,"X",null,null,null,null,null,"X",null,"UHF",null,"X","X","X","SINGLE","XB-Only","DVR (UHF) Crossband/No Inband; For APX (UHF+700+800) using Single-Band Antenna(s)",2,14,3,0,793,12,2,"8J087X51-46",""]
[null,null,"X",null,null,null,null,null,null,"UHF",null,"X","X","X","ALL","XB-Only","DVR (UHF) Crossband/No Inband; For APX (UHF+700+800) using One All-Band Antenna",2,14,3,1,794,3,2,"8J087X51-04",""]
[null,null,"X",null,null,null,null,null,null,"UHF",null,"X","X","X","USER","XB-Only","DVR (UHF) Crossband/No Inband; For APX (UHF+700+800) using Unknown or User-Defined Antenna",2,14,3,2,795,3,2,"No Drawing",""]
[null,"X",null,null,null,"X",null,null,null,"UHF",null,"X","X","X","SINGLE","IB+XB","DVR (UHF) Inband & Crossband; For APX (UHF+700+800) using Single-Band Antenna(s)",2,14,5,0,799,8,2,"No Drawing",""]
[null,null,null,"X",null,"X",null,null,null,"UHF",null,"X","X","X","ALL","IB+XB","DVR (UHF) Inband & Crossband; For APX (UHF+700+800) using One All-Band Antenna",2,14,5,1,800,10,2,"8J087X51-28",""]
[null,null,null,"X",null,"X",null,null,null,"UHF",null,"X","X","X","USER","IB+XB","DVR (UHF) Inband & Crossband; For APX (UHF+700+800) using Unknown or User-Defined Antenna",2,14,5,2,801,10,2,"No Drawing",""]
[null,"X",null,null,null,"X",null,null,null,"UHF","X","X","X","X","SINGLE","IB-Only","DVR (UHF) Inband/No Crossband; For APX (VHF+UHF+700+800) using Single-Band Antenna(s)",2,15,1,0,804,8,3,"No Drawing",""]
[null,null,null,null,null,"X",null,null,null,"UHF","X","X","X","X","ALL","IB-Only","DVR (UHF) Inband/No Crossband; For APX (VHF+UHF+700+800) using One All-Band Antenna",2,15,1,1,805,6,3,"No Drawing",""]
[null,null,null,null,null,"X",null,null,null,"UHF","X","X","X","X","USER","IB-Only","DVR (UHF) Inband/No Crossband; For APX (VHF+UHF+700+800) using Unknown or User-Defined Antenna",2,15,1,2,806,6,3,"No Drawing",""]
[null,"X",null,null,null,null,null,"X",null,"UHF","X","X","X","X","SINGLE","XB-Only","DVR (UHF) Crossband/No Inband; For APX (VHF+UHF+700+800) using Single-Band Antenna(s)",2,15,3,0,810,12,3,"8J087X51-56",""]
[null,null,null,null,"X",null,null,null,null,"UHF","X","X","X","X","ALL","XB-Only","DVR (UHF) Crossband/No Inband; For APX (VHF+UHF+700+800) using One All-Band Antenna",2,15,3,1,811,5,3,"8J087X51-38",""]
[null,null,null,null,"X",null,null,null,null,"UHF","X","X","X","X","USER","XB-Only","DVR (UHF) Crossband/No Inband; For APX (VHF+UHF+700+800) using Unknown or User-Defined Antenna",2,15,3,2,812,5,3,"No Drawing",""]
[null,"X",null,null,null,"X",null,null,null,"UHF","X","X","X","X","SINGLE","IB+XB","DVR (UHF) Inband & Crossband; For APX (VHF+UHF+700+800) using Single-Band Antenna(s)",2,15,5,0,816,8,3,"No Drawing",""]
[null,null,null,"X",null,"X",null,null,null,"UHF","X","X","X","X","ALL","IB+XB","DVR (UHF) Inband & Crossband; For APX (VHF+UHF+700+800) using One All-Band Antenna",2,15,5,1,817,10,3,"8J087X51-35",""]
[null,null,null,"X",null,"X",null,null,null,"UHF","X","X","X","X","USER","IB+XB","DVR (UHF) Inband & Crossband; For APX (VHF+UHF+700+800) using Unknown or User-Defined Antenna",2,15,5,2,818,10,3,"No Drawing",""]
[null,"X",null,null,null,null,null,null,null,700,"X",null,null,null,"SINGLE","XB-Forced","DVR (700) Crossband; For APX (VHF) using Single-Band Antenna(s)",3,1,4,0,848,2,1,"No Drawing",""]
[null,"X",null,null,null,null,null,null,null,700,"X",null,null,null,"ALL","XB-Forced","DVR (700) Crossband; For APX (VHF) using One All-Band Antenna",3,1,4,1,849,2,1,"No Drawing",""]
[null,"X",null,null,null,null,null,null,null,700,"X",null,null,null,"USER","XB-Forced","DVR (700) Crossband; For APX (VHF) using Unknown or User-Defined Antenna",3,1,4,2,850,2,1,"No Drawing",""]
[null,"X",null,null,null,null,null,null,null,700,null,"X",null,null,"SINGLE","XB-Forced","DVR (700) Crossband; For APX (UHF) using Single-Band Antenna(s)",3,2,4,0,865,2,1,"No Drawing",""]
[null,"X",null,null,null,null,null,null,null,700,null,"X",null,null,"ALL","XB-Forced","DVR (700) Crossband; For APX (UHF) using One All-Band Antenna",3,2,4,1,866,2,1,"No Drawing",""]
[null,"X",null,null,null,null,null,null,null,700,null,"X",null,null,"USER","XB-Forced","DVR (700) Crossband; For APX (UHF) using Unknown or User-Defined Antenna",3,2,4,2,867,2,1,"No Drawing",""]
[null,"X",null,null,null,null,null,null,null,700,"X","X",null,null,"SINGLE","XB-Forced","DVR (700) Crossband; For APX (VHF+UHF) using Single-Band Antenna(s)",3,3,4,0,882,2,2,"No Drawing",""]
[null,null,null,"X",null,null,null,null,null,700,"X","X",null,null,"ALL","XB-Forced","DVR (700) Crossband; For APX (VHF+UHF) using One All-Band Antenna",3,3,4,1,883,4,2,"8J087X51-18",""]
[null,null,null,"X",null,null,null,null,null,700,"X","X",null,null,"USER","XB-Forced","DVR (700) Crossband; For APX (VHF+UHF) using Unknown or User-Defined Antenna",3,3,4,2,884,4,2,"No Drawing",""]
["X",null,null,null,null,"X",null,null,null,700,null,null,"X",null,"SINGLE","IB-Forced","DVR (700) Inband; For APX (700) using Single-Band Antenna(s)",3,4,2,0,893,7,1,"No Drawing",""]
["X",null,null,null,null,"X",null,null,null,700,null,null,"X",null,"ALL","IB-Forced","DVR (700) Inband; For APX (700) using One All-Band Antenna",3,4,2,1,894,7,1,"No Drawing",""]
["X",null,null,null,null,"X",null,null,null,700,null,null,"X",null,"USER","IB-Forced","DVR (700) Inband; For APX (700) using Unknown or User-Defined Antenna",3,4,2,2,895,7,1,"No Drawing",""]
[" ",null,null,null,null,null,null,null,"INVALID COMBO",700,null,null,"X",null,"SINGLE","XB-Only",{"$f":"$J$6&\"(\"&$J199&\")\"&\" \"&VLOOKUP($P199,RPTCodes,2,FALSE) &\"; For APX (\"&VLOOKUP($S199,BAND_NAMES,2)&\") using \"&VLOOKUP($O199,ANTcodes,3,FALSE)","v":"DVR (700) Crossband/No Inband; For APX (700) using Single-Band Antenna(s)"},{"$f":"VLOOKUP(J199,Freq_Bands,2)","v":3},{"$f":"IF(K199=\"X\",1,0)+IF(L199=\"X\",2,0)+IF(M199=\"X\",4,0)+IF(N199=\"X\",8,0)","v":4},{"$f":"VLOOKUP(P199,RPTCodes,4,FALSE)","v":3},{"$f":"VLOOKUP(O199,ANTcodes,2,FALSE)","v":0},{"$f":"$U199*MULT_ANT+$T199*MULT_RPT+$S199*MULT_MRF+$R199*MULT_VRF","v":896},{"$f":"IF($A199=\"X\",1,0)+IF($B199=\"X\",2,0)+IF($C199=\"X\",3,0)+IF($D199=\"X\",4,0)+IF($E199=\"X\",5,0)+IF($F199=\"X\",6,0)+IF($H199=\"X\",10,0)","v":0},{"$f":"COUNTA(K199:L199)+IF(RIGHT(M199&N199,1)=\"X\",1,0)","v":1},"No Drawing",{"$f":"IF(COUNTIF($A199:$H199, \"<>\"&\"\")=0,\"INVALID COMBO\",\"\")","v":""}]
[null,null,null,null,null,null,null,null,"INVALID COMBO",700,null,null,"X",null,"ALL","XB-Only","DVR (700) Crossband/No Inband; For APX (700) using One All-Band Antenna",3,4,3,1,897,0,1,"No Drawing","INVALID COMBO"]
[" ",null,null,null,null,null,null,null,"INVALID COMBO",700,null,null,"X",null,"USER","XB-Only","DVR (700) Crossband/No Inband; For APX (700) using Unknown or User-Defined Antenna",3,4,3,2,898,0,1,"No Drawing",""]
[null,"X",null,null,null,"X",null,null,null,700,"X",null,"X",null,"SINGLE","IB-Only","DVR (700) Inband/No Crossband; For APX (VHF+700) using Single-Band Antenna(s)",3,5,1,0,907,8,2,"No Drawing",""]
[null,null,null,null,null,"X",null,null,null,700,"X",null,"X",null,"ALL","IB-Only","DVR (700) Inband/No Crossband; For APX (VHF+700) using One All-Band Antenna",3,5,1,1,908,6,2,"No Drawing",""]
[null,null,null,null,null,"X",null,null,null,700,"X",null,"X",null,"USER","IB-Only","DVR (700) Inband/No Crossband; For APX (VHF+700) using Unknown or User-Defined Antenna",3,5,1,2,909,6,2,"No Drawing",""]
[null,"X",null,null,null,null,null,"X",null,700,"X",null,"X",null,"SINGLE","XB-Only","DVR (700) Crossband/No Inband; For APX (VHF+700) using Single-Band Antenna(s)",3,5,3,0,913,12,2,"8J087X51-47",""]
[null,null,"X",null,null,null,null,null,null,700,"X",null,"X",null,"ALL","XB-Only","DVR (700) Crossband/No Inband; For APX (VHF+700) using One All-Band Antenna",3,5,3,1,914,3,2,"8J087X51-05",""]
[null,null,"X",null,null,null,null,null,null,700,"X",null,"X",null,"USER","XB-Only","DVR (700) Crossband/No Inband; For APX (VHF+700) using Unknown or User-Defined Antenna",3,5,3,2,915,3,2,"No Drawing",""]
[null,"X",null,null,null,"X",null,null,null,700,"X",null,"X",null,"SINGLE","IB+XB","DVR (700) Inband & Crossband; For APX (VHF+700) using Single-Band Antenna(s)",3,5,5,0,919,8,2,"No Drawing",""]
[null,null,null,"X",null,"X",null,null,null,700,"X",null,"X",null,"ALL","IB+XB","DVR (700) Inband & Crossband; For APX (VHF+700) using One All-Band Antenna",3,5,5,1,920,10,2,"8J087X51-29",""]
[null,null,null,"X",null,"X",null,null,null,700,"X",null,"X",null,"USER","IB+XB","DVR (700) Inband & Crossband; For APX (VHF+700) using Unknown or User-Defined Antenna",3,5,5,2,921,10,2,"No Drawing",""]
[null,"X",null,null,null,"X",null,null,null,700,null,"X","X",null,"SINGLE","IB-Only","DVR (700) Inband/No Crossband; For APX (UHF+700) using Single-Band Antenna(s)",3,6,1,0,924,8,2,"No Drawing",""]
[null,null,null,null,null,"X",null,null,null,700,null,"X","X",null,"ALL","IB-Only","DVR (700) Inband/No Crossband; For APX (UHF+700) using One All-Band Antenna",3,6,1,1,925,6,2,"No Drawing",""]
[null,null,null,null,null,"X",null,null,null,700,null,"X","X",null,"USER","IB-Only","DVR (700) Inband/No Crossband; For APX (UHF+700) using Unknown or User-Defined Antenna",3,6,1,2,926,6,2,"No Drawing",""]
[null,"X",null,null,null,null,null,"X",null,700,null,"X","X",null,"SINGLE","XB-Only","DVR (700) Crossband/No Inband; For APX (UHF+700) using Single-Band Antenna(s)",3,6,3,0,930,12,2,"8J087X51-48",""]
[null,null,"X",null,null,null,null,null,null,700,null,"X","X",null,"ALL","XB-Only","DVR (700) Crossband/No Inband; For APX (UHF+700) using One All-Band Antenna",3,6,3,1,931,3,2,"8J087X51-06",""]
[null,null,"X",null,null,null,null,null,null,700,null,"X","X",null,"USER","XB-Only","DVR (700) Crossband/No Inband; For APX (UHF+700) using Unknown or User-Defined Antenna",3,6,3,2,932,3,2,"No Drawing",""]
[null,"X",null,null,null,"X",null,null,null,700,null,"X","X",null,"SINGLE","IB+XB","DVR (700) Inband & Crossband; For APX (UHF+700) using Single-Band Antenna(s)",3,6,5,0,936,8,2,"No Drawing",""]
[null,null,null,"X",null,"X",null,null,null,700,null,"X","X",null,"ALL","IB+XB","DVR (700) Inband & Crossband; For APX (UHF+700) using One All-Band Antenna",3,6,5,1,937,10,2,"8J087X51-30",""]
[null,null,null,"X",null,"X",null,null,null,700,null,"X","X",null,"USER","IB+XB","DVR (700) Inband & Crossband; For APX (UHF+700) using Unknown or User-Defined Antenna",3,6,5,2,938,10,2,"No Drawing",""]
[null,"X",null,null,null,"X",null,null,null,700,"X","X","X",null,"SINGLE","IB-Only","DVR (700) Inband/No Crossband; For APX (VHF+UHF+700) using Single-Band Antenna(s)",3,7,1,0,941,8,3,"No Drawing",""]
[null,null,null,null,null,"X",null,null,null,700,"X","X","X",null,"ALL","IB-Only","DVR (700) Inband/No Crossband; For APX (VHF+UHF+700) using One All-Band Antenna",3,7,1,1,942,6,3,"No Drawing",""]
[null,null,null,null,null,"X",null,null,null,700,"X","X","X",null,"USER","IB-Only","DVR (700) Inband/No Crossband; For APX (VHF+UHF+700) using Unknown or User-Defined Antenna",3,7,1,2,943,6,3,"No Drawing",""]
[null,"X",null,null,null,null,null,"X",null,700,"X","X","X",null,"SINGLE","XB-Only","DVR (700) Crossband/No Inband; For APX (VHF+UHF+700) using Single-Band Antenna(s)",3,7,3,0,947,12,3,"8J087X51-57",""]
[null,null,null,null,"X",null,null,null,null,700,"X","X","X",null,"ALL","XB-Only","DVR (700) Crossband/No Inband; For APX (VHF+UHF+700) using One All-Band Antenna",3,7,3,1,948,5,3,"8J087X51-39",""]
[null,null,null,null,"X",null,null,null,null,700,"X","X","X",null,"USER","XB-Only","DVR (700) Crossband/No Inband; For APX (VHF+UHF+700) using Unknown or User-Defined Antenna",3,7,3,2,949,5,3,"No Drawing",""]
[null,"X",null,null,null,"X",null,null,null,700,"X","X","X",null,"SINGLE","IB+XB","DVR (700) Inband & Crossband; For APX (VHF+UHF+700) using Single-Band Antenna(s)",3,7,5,0,953,8,3,"No Drawing",""]
[null,null,null,"X",null,"X",null,null,null,700,"X","X","X",null,"ALL","IB+XB","DVR (700) Inband & Crossband; For APX (VHF+UHF+700) using One All-Band Antenna",3,7,5,1,954,10,3,"8J087X51-36",""]
[null,null,null,"X",null,"X",null,null,null,700,"X","X","X",null,"USER","IB+XB","DVR (700) Inband & Crossband; For APX (VHF+UHF+700) using Unknown or User-Defined Antenna",3,7,5,2,955,10,3,"No Drawing",""]
["X",null,null,null,null,"X",null,null,null,700,null,null,null,"X","SINGLE","IB-Forced","DVR (700) Inband; For APX (800) using Single-Band Antenna(s)",3,8,2,0,961,7,1,"No Drawing",""]
["X",null,null,null,null,"X",null,null,null,700,null,null,null,"X","ALL","IB-Forced","DVR (700) Inband; For APX (800) using One All-Band Antenna",3,8,2,1,962,7,1,"No Drawing",""]
["X",null,null,null,null,"X",null,null,null,700,null,null,null,"X","USER","IB-Forced","DVR (700) Inband; For APX (800) using Unknown or User-Defined Antenna",3,8,2,2,963,7,1,"No Drawing",""]
[null,null,null,null,null,null,null,null,"INVALID COMBO",700,null,null,null,"X","SINGLE","XB-Only","DVR (700) Crossband/No Inband; For APX (800) using Single-Band Antenna(s)",3,8,3,0,964,0,1,"No Drawing","INVALID COMBO"]
[null,null,null,null,null,null,null,null,"INVALID COMBO",700,null,null,null,"X","ALL","XB-Only","DVR (700) Crossband/No Inband; For APX (800) using One All-Band Antenna",3,8,3,1,965,0,1,"No Drawing","INVALID COMBO"]
[null,null,null,null,null,null,null,null,"INVALID COMBO",700,null,null,null,"X","USER","XB-Only","DVR (700) Crossband/No Inband; For APX (800) using Unknown or User-Defined Antenna",3,8,3,2,966,0,1,"No Drawing","INVALID COMBO"]
[null,"X",null,null,null,"X",null,null,null,700,"X",null,null,"X","SINGLE","IB-Only","DVR (700) Inband/No Crossband; For APX (VHF+800) using Single-Band Antenna(s)",3,9,1,0,975,8,2,"No Drawing",""]
[null,null,null,null,null,"X",null,null,null,700,"X",null,null,"X","ALL","IB-Only","DVR (700) Inband/No Crossband; For APX (VHF+800) using One All-Band Antenna",3,9,1,1,976,6,2,"No Drawing",""]
[null,null,null,null,null,"X",null,null,null,700,"X",null,null,"X","USER","IB-Only","DVR (700) Inband/No Crossband; For APX (VHF+800) using Unknown or User-Defined Antenna",3,9,1,2,977,6,2,"No Drawing",""]
[null,"X",null,null,null,null,null,"X",null,700,"X",null,null,"X","SINGLE","XB-Only","DVR (700) Crossband/No Inband; For APX (VHF+800) using Single-Band Antenna(s)",3,9,3,0,981,12,2,"8J087X51-47",""]
[null,null,"X",null,null,null,null,null,null,700,"X",null,null,"X","ALL","XB-Only","DVR (700) Crossband/No Inband; For APX (VHF+800) using One All-Band Antenna",3,9,3,1,982,3,2,"8J087X51-05",""]
[null,null,"X",null,null,null,null,null,null,700,"X",null,null,"X","USER","XB-Only","DVR (700) Crossband/No Inband; For APX (VHF+800) using Unknown or User-Defined Antenna",3,9,3,2,983,3,2,"No Drawing",""]
[null,"X",null,null,null,"X",null,null,null,700,"X",null,null,"X","SINGLE","IB+XB","DVR (700) Inband & Crossband; For APX (VHF+800) using Single-Band Antenna(s)",3,9,5,0,987,8,2,"No Drawing",""]
[null,null,null,"X",null,"X",null,null,null,700,"X",null,null,"X","ALL","IB+XB","DVR (700) Inband & Crossband; For APX (VHF+800) using One All-Band Antenna",3,9,5,1,988,10,2,"8J087X51-29",""]
[null,null,null,"X",null,"X",null,null,null,700,"X",null,null,"X","USER","IB+XB","DVR (700) Inband & Crossband; For APX (VHF+800) using Unknown or User-Defined Antenna",3,9,5,2,989,10,2,"No Drawing",""]
[null,"X",null,null,null,"X",null,null,null,700,null,"X",null,"X","SINGLE","IB-Only","DVR (700) Inband/No Crossband; For APX (UHF+800) using Single-Band Antenna(s)",3,10,1,0,992,8,2,"No Drawing",""]
[null,null,null,null,null,"X",null,null,null,700,null,"X",null,"X","ALL","IB-Only","DVR (700) Inband/No Crossband; For APX (UHF+800) using One All-Band Antenna",3,10,1,1,993,6,2,"No Drawing",""]
[null,null,null,null,null,"X",null,null,null,700,null,"X",null,"X","USER","IB-Only","DVR (700) Inband/No Crossband; For APX (UHF+800) using Unknown or User-Defined Antenna",3,10,1,2,994,6,2,"No Drawing",""]
[null,"X",null,null,null,null,null,"X",null,700,null,"X",null,"X","SINGLE","XB-Only","DVR (700) Crossband/No Inband; For APX (UHF+800) using Single-Band Antenna(s)",3,10,3,0,998,12,2,"8J087X51-48",""]
[null,null,"X",null,null,null,null,null,null,700,null,"X",null,"X","ALL","XB-Only","DVR (700) Crossband/No Inband; For APX (UHF+800) using One All-Band Antenna",3,10,3,1,999,3,2,"8J087X51-06",""]
[null,null,"X",null,null,null,null,null,null,700,null,"X",null,"X","USER","XB-Only","DVR (700) Crossband/No Inband; For APX (UHF+800) using Unknown or User-Defined Antenna",3,10,3,2,1000,3,2,"No Drawing",""]
[null,"X",null,null,null,"X",null,null,null,700,null,"X",null,"X","SINGLE","IB+XB","DVR (700) Inband & Crossband; For APX (UHF+800) using Single-Band Antenna(s)",3,10,5,0,1004,8,2,"No Drawing",""]
[null,null,null,"X",null,"X",null,null,null,700,null,"X",null,"X","ALL","IB+XB","DVR (700) Inband & Crossband; For APX (UHF+800) using One All-Band Antenna",3,10,5,1,1005,10,2,"8J087X51-30",""]
[null,null,null,"X",null,"X",null,null,null,700,null,"X",null,"X","USER","IB+XB","DVR (700) Inband & Crossband; For APX (UHF+800) using Unknown or User-Defined Antenna",3,10,5,2,1006,10,2,"No Drawing",""]
[null,"X",null,null,null,"X",null,null,null,700,"X","X",null,"X","SINGLE","IB-Only","DVR (700) Inband/No Crossband; For APX (VHF+UHF+800) using Single-Band Antenna(s)",3,11,1,0,1009,8,3,"No Drawing",""]
[null,null,null,null,null,"X",null,null,null,700,"X","X",null,"X","ALL","IB-Only","DVR (700) Inband/No Crossband; For APX (VHF+UHF+800) using One All-Band Antenna",3,11,1,1,1010,6,3,"No Drawing",""]
[null,null,null,null,null,"X",null,null,null,700,"X","X",null,"X","USER","IB-Only","DVR (700) Inband/No Crossband; For APX (VHF+UHF+800) using Unknown or User-Defined Antenna",3,11,1,2,1011,6,3,"No Drawing",""]
[null,"X",null,null,null,null,null,"X",null,700,"X","X",null,"X","SINGLE","XB-Only","DVR (700) Crossband/No Inband; For APX (VHF+UHF+800) using Single-Band Antenna(s)",3,11,3,0,1015,12,3,"8J087X51-57",""]
[null,null,null,null,"X",null,null,null,null,700,"X","X",null,"X","ALL","XB-Only","DVR (700) Crossband/No Inband; For APX (VHF+UHF+800) using One All-Band Antenna",3,11,3,1,1016,5,3,"8J087X51-39",""]
[null,null,null,null,"X",null,null,null,null,700,"X","X",null,"X","USER","XB-Only","DVR (700) Crossband/No Inband; For APX (VHF+UHF+800) using Unknown or User-Defined Antenna",3,11,3,2,1017,5,3,"No Drawing",""]
[null,"X",null,null,null,"X",null,null,null,700,"X","X",null,"X","SINGLE","IB+XB","DVR (700) Inband & Crossband; For APX (VHF+UHF+800) using Single-Band Antenna(s)",3,11,5,0,1021,8,3,"No Drawing",""]
[null,null,null,"X",null,"X",null,null,null,700,"X","X",null,"X","ALL","IB+XB","DVR (700) Inband & Crossband; For APX (VHF+UHF+800) using One All-Band Antenna",3,11,5,1,1022,10,3,"8J087X51-36",""]
[null,null,null,"X",null,"X",null,null,null,700,"X","X",null,"X","USER","IB+XB","DVR (700) Inband & Crossband; For APX (VHF+UHF+800) using Unknown or User-Defined Antenna",3,11,5,2,1023,10,3,"No Drawing",""]
["X",null,null,null,null,"X",null,null,null,700,null,null,"X","X","SINGLE","IB-Forced","DVR (700) Inband; For APX (700+800) using Single-Band Antenna(s)",3,12,2,0,1029,7,1,"No Drawing",""]
["X",null,null,null,null,"X",null,null,null,700,null,null,"X","X","ALL","IB-Forced",{"$f":"$J$6&\"(\"&$J263&\")\"&\" \"&VLOOKUP($P263,RPTCodes,2,FALSE) &\"; For APX (\"&VLOOKUP($S263,BAND_NAMES,2)&\") using \"&VLOOKUP($O263,ANTcodes,3,FALSE)","v":"DVR (700) Inband; For APX (700+800) using One All-Band Antenna"},{"$f":"VLOOKUP(J263,Freq_Bands,2)","v":3},{"$f":"IF(K263=\"X\",1,0)+IF(L263=\"X\",2,0)+IF(M263=\"X\",4,0)+IF(N263=\"X\",8,0)","v":12},{"$f":"VLOOKUP(P263,RPTCodes,4,FALSE)","v":2},{"$f":"VLOOKUP(O263,ANTcodes,2,FALSE)","v":1},{"$f":"$U263*MULT_ANT+$T263*MULT_RPT+$S263*MULT_MRF+$R263*MULT_VRF","v":1030},{"$f":"IF($A263=\"X\",1,0)+IF($B263=\"X\",2,0)+IF($C263=\"X\",3,0)+IF($D263=\"X\",4,0)+IF($E263=\"X\",5,0)+IF($F263=\"X\",6,0)+IF($H263=\"X\",10,0)","v":7},{"$f":"COUNTA(K263:L263)+IF(RIGHT(M263&N263,1)=\"X\",1,0)","v":1},"No Drawing",{"$f":"IF(COUNTIF($A263:$H263, \"<>\"&\"\")=0,\"INVALID COMBO\",\"\")","v":""}]
["X",null,null,null,null,"X",null,null,null,700,null,null,"X","X","USER","IB-Forced","DVR (700) Inband; For APX (700+800) using Unknown or User-Defined Antenna",3,12,2,2,1031,7,1,"No Drawing",""]
[null,null,null,null,null,null,null,null,"INVALID COMBO",700,null,null,"X","X","SINGLE","XB-Only","DVR (700) Crossband/No Inband; For APX (700+800) using Single-Band Antenna(s)",3,12,3,0,1032,0,1,"No Drawing","INVALID COMBO"]
[null,null,null,null,null,null,null,null,"INVALID COMBO",700,null,null,"X","X","ALL","XB-Only","DVR (700) Crossband/No Inband; For APX (700+800) using One All-Band Antenna",3,12,3,1,1033,0,1,"No Drawing","INVALID COMBO"]
[null,null,null,null,null,null,null,null,"INVALID COMBO",700,null,null,"X","X","USER","XB-Only","DVR (700) Crossband/No Inband; For APX (700+800) using Unknown or User-Defined Antenna",3,12,3,2,1034,0,1,"No Drawing","INVALID COMBO"]
[null,"X",null,null,null,"X",null,null,null,700,"X",null,"X","X","SINGLE","IB-Only","DVR (700) Inband/No Crossband; For APX (VHF+700+800) using Single-Band Antenna(s)",3,13,1,0,1043,8,2,"No Drawing",""]
[null,null,null,null,null,"X",null,null,null,700,"X",null,"X","X","ALL","IB-Only","DVR (700) Inband/No Crossband; For APX (VHF+700+800) using One All-Band Antenna",3,13,1,1,1044,6,2,"No Drawing",""]
[null,null,null,null,null,"X",null,null,null,700,"X",null,"X","X","USER","IB-Only","DVR (700) Inband/No Crossband; For APX (VHF+700+800) using Unknown or User-Defined Antenna",3,13,1,2,1045,6,2,"No Drawing",""]
[null,"X",null,null,null,null,null,"X",null,700,"X",null,"X","X","SINGLE","XB-Only","DVR (700) Crossband/No Inband; For APX (VHF+700+800) using Single-Band Antenna(s)",3,13,3,0,1049,12,2,"8J087X51-47",""]
[null,null,"X",null,null,null,null,null,null,700,"X",null,"X","X","ALL","XB-Only","DVR (700) Crossband/No Inband; For APX (VHF+700+800) using One All-Band Antenna",3,13,3,1,1050,3,2,"8J087X51-05",""]
[null,null,"X",null,null,null,null,null,null,700,"X",null,"X","X","USER","XB-Only","DVR (700) Crossband/No Inband; For APX (VHF+700+800) using Unknown or User-Defined Antenna",3,13,3,2,1051,3,2,"No Drawing",""]
[null,"X",null,null,null,"X",null,null,null,700,"X",null,"X","X","SINGLE","IB+XB","DVR (700) Inband & Crossband; For APX (VHF+700+800) using Single-Band Antenna(s)",3,13,5,0,1055,8,2,"No Drawing",""]
[null,null,null,"X",null,"X",null,null,null,700,"X",null,"X","X","ALL","IB+XB","DVR (700) Inband & Crossband; For APX (VHF+700+800) using One All-Band Antenna",3,13,5,1,1056,10,2,"8J087X51-29",""]
[null,null,null,"X",null,"X",null,null,null,700,"X",null,"X","X","USER","IB+XB","DVR (700) Inband & Crossband; For APX (VHF+700+800) using Unknown or User-Defined Antenna",3,13,5,2,1057,10,2,"No Drawing",""]
[null,"X",null,null,null,"X",null,null,null,700,null,"X","X","X","SINGLE","IB-Only","DVR (700) Inband/No Crossband; For APX (UHF+700+800) using Single-Band Antenna(s)",3,14,1,0,1060,8,2,"No Drawing",""]
[null,null,null,null,null,"X",null,null,null,700,null,"X","X","X","ALL","IB-Only","DVR (700) Inband/No Crossband; For APX (UHF+700+800) using One All-Band Antenna",3,14,1,1,1061,6,2,"No Drawing",""]
[null,null,null,null,null,"X",null,null,null,700,null,"X","X","X","USER","IB-Only","DVR (700) Inband/No Crossband; For APX (UHF+700+800) using Unknown or User-Defined Antenna",3,14,1,2,1062,6,2,"No Drawing",""]
[null,"X",null,null,null,null,null,"X",null,700,null,"X","X","X","SINGLE","XB-Only","DVR (700) Crossband/No Inband; For APX (UHF+700+800) using Single-Band Antenna(s)",3,14,3,0,1066,12,2,"8J087X51-48",""]
[null,null,"X",null,null,null,null,null,null,700,null,"X","X","X","ALL","XB-Only","DVR (700) Crossband/No Inband; For APX (UHF+700+800) using One All-Band Antenna",3,14,3,1,1067,3,2,"8J087X51-06",""]
[null,null,"X",null,null,null,null,null,null,700,null,"X","X","X","USER","XB-Only","DVR (700) Crossband/No Inband; For APX (UHF+700+800) using Unknown or User-Defined Antenna",3,14,3,2,1068,3,2,"No Drawing",""]
[null,"X",null,null,null,"X",null,null,null,700,null,"X","X","X","SINGLE","IB+XB","DVR (700) Inband & Crossband; For APX (UHF+700+800) using Single-Band Antenna(s)",3,14,5,0,1072,8,2,"No Drawing",""]
[null,null,null,"X",null,"X",null,null,null,700,null,"X","X","X","ALL","IB+XB","DVR (700) Inband & Crossband; For APX (UHF+700+800) using One All-Band Antenna",3,14,5,1,1073,10,2,"8J087X51-30",""]
[null,null,null,"X",null,"X",null,null,null,700,null,"X","X","X","USER","IB+XB","DVR (700) Inband & Crossband; For APX (UHF+700+800) using Unknown or User-Defined Antenna",3,14,5,2,1074,10,2,"No Drawing",""]
[null,"X",null,null,null,"X",null,null,null,700,"X","X","X","X","SINGLE","IB-Only","DVR (700) Inband/No Crossband; For APX (VHF+UHF+700+800) using Single-Band Antenna(s)",3,15,1,0,1077,8,3,"No Drawing",""]
[null,null,null,null,null,"X",null,null,null,700,"X","X","X","X","ALL","IB-Only","DVR (700) Inband/No Crossband; For APX (VHF+UHF+700+800) using One All-Band Antenna",3,15,1,1,1078,6,3,"No Drawing",""]
[null,null,null,null,null,"X",null,null,null,700,"X","X","X","X","USER","IB-Only","DVR (700) Inband/No Crossband; For APX (VHF+UHF+700+800) using Unknown or User-Defined Antenna",3,15,1,2,1079,6,3,"No Drawing",""]
[null,"X",null,null,null,null,null,"X",null,700,"X","X","X","X","SINGLE","XB-Only","DVR (700) Crossband/No Inband; For APX (VHF+UHF+700+800) using Single-Band Antenna(s)",3,15,3,0,1083,12,3,"8J087X51-57",""]
[null,null,null,null,"X",null,null,null,null,700,"X","X","X","X","ALL","XB-Only","DVR (700) Crossband/No Inband; For APX (VHF+UHF+700+800) using One All-Band Antenna",3,15,3,1,1084,5,3,"8J087X51-39",""]
[null,null,null,null,"X",null,null,null,null,700,"X","X","X","X","USER","XB-Only","DVR (700) Crossband/No Inband; For APX (VHF+UHF+700+800) using Unknown or User-Defined Antenna",3,15,3,2,1085,5,3,"No Drawing",""]
[null,"X",null,null,null,"X",null,null,null,700,"X","X","X","X","SINGLE","IB+XB","DVR (700) Inband & Crossband; For APX (VHF+UHF+700+800) using Single-Band Antenna(s)",3,15,5,0,1089,8,3,"No Drawing",""]
[null,null,null,"X",null,"X",null,null,null,700,"X","X","X","X","ALL","IB+XB","DVR (700) Inband & Crossband; For APX (VHF+UHF+700+800) using One All-Band Antenna",3,15,5,1,1090,10,3,"8J087X51-36",""]
[null,null,null,"X",null,"X",null,null,null,700,"X","X","X","X","USER","IB+XB","DVR (700) Inband & Crossband; For APX (VHF+UHF+700+800) using Unknown or User-Defined Antenna",3,15,5,2,1091,10,3,"No Drawing",""]
[null,"X",null,null,null,null,null,null,null,800,"X",null,null,null,"SINGLE","XB-Forced","DVR (800) Crossband; For APX (VHF) using Single-Band Antenna(s)",4,1,4,0,1121,2,1,"No Drawing",""]
[null,"X",null,null,null,null,null,null,null,800,"X",null,null,null,"ALL","XB-Forced","DVR (800) Crossband; For APX (VHF) using One All-Band Antenna",4,1,4,1,1122,2,1,"No Drawing",""]
[null,"X",null,null,null,null,null,null,null,800,"X",null,null,null,"USER","XB-Forced","DVR (800) Crossband; For APX (VHF) using Unknown or User-Defined Antenna",4,1,4,2,1123,2,1,"No Drawing",""]
[null,"X",null,null,null,null,null,null,null,800,null,"X",null,null,"SINGLE","XB-Forced","DVR (800) Crossband; For APX (UHF) using Single-Band Antenna(s)",4,2,4,0,1138,2,1,"No Drawing",""]
[null,"X",null,null,null,null,null,null,null,800,null,"X",null,null,"ALL","XB-Forced","DVR (800) Crossband; For APX (UHF) using One All-Band Antenna",4,2,4,1,1139,2,1,"No Drawing",""]
[null,"X",null,null,null,null,null,null,null,800,null,"X",null,null,"USER","XB-Forced","DVR (800) Crossband; For APX (UHF) using Unknown or User-Defined Antenna",4,2,4,2,1140,2,1,"No Drawing",""]
[null,"X",null,null,null,null,null,null,null,800,"X","X",null,null,"SINGLE","XB-Forced","DVR (800) Crossband; For APX (VHF+UHF) using Single-Band Antenna(s)",4,3,4,0,1155,2,2,"No Drawing",""]
[null,null,null,"X",null,null,null,null,null,800,"X","X",null,null,"ALL","XB-Forced","DVR (800) Crossband; For APX (VHF+UHF) using One All-Band Antenna",4,3,4,1,1156,4,2,"8J087X51-18",""]
[null,null,null,"X",null,null,null,null,null,800,"X","X",null,null,"USER","XB-Forced","DVR (800) Crossband; For APX (VHF+UHF) using Unknown or User-Defined Antenna",4,3,4,2,1157,4,2,"No Drawing",""]
["X",null,null,null,null,"X",null,null,null,800,null,null,"X",null,"SINGLE","IB-Forced","DVR (800) Inband; For APX (700) using Single-Band Antenna(s)",4,4,2,0,1166,7,1,"No Drawing",""]
["X",null,null,null,null,"X",null,null,null,800,null,null,"X",null,"ALL","IB-Forced","DVR (800) Inband; For APX (700) using One All-Band Antenna",4,4,2,1,1167,7,1,"No Drawing",""]
["X",null,null,null,null,"X",null,null,null,800,null,null,"X",null,"USER","IB-Forced","DVR (800) Inband; For APX (700) using Unknown or User-Defined Antenna",4,4,2,2,1168,7,1,"No Drawing",""]
[null,null,null,null,null,null,null,null,"INVALID COMBO",800,null,null,"X",null,"SINGLE","XB-Only","DVR (800) Crossband/No Inband; For APX (700) using Single-Band Antenna(s)",4,4,3,0,1169,0,1,"No Drawing","INVALID COMBO"]
[null,null,null,null,null,null,null,null,"INVALID COMBO",800,null,null,"X",null,"ALL","XB-Only","DVR (800) Crossband/No Inband; For APX (700) using One All-Band Antenna",4,4,3,1,1170,0,1,"No Drawing","INVALID COMBO"]
[null,null,null,null,null,null,null,null,"INVALID COMBO",800,null,null,"X",null,"USER","XB-Only","DVR (800) Crossband/No Inband; For APX (700) using Unknown or User-Defined Antenna",4,4,3,2,1171,0,1,"No Drawing","INVALID COMBO"]
[null,"X",null,null,null,"X",null,null,null,800,"X",null,"X",null,"SINGLE","IB-Only","DVR (800) Inband/No Crossband; For APX (VHF+700) using Single-Band Antenna(s)",4,5,1,0,1180,8,2,"No Drawing",""]
[null,null,null,null,null,"X",null,null,null,800,"X",null,"X",null,"ALL","IB-Only","DVR (800) Inband/No Crossband; For APX (VHF+700) using One All-Band Antenna",4,5,1,1,1181,6,2,"No Drawing",""]
[null,null,null,null,null,"X",null,null,null,800,"X",null,"X",null,"USER","IB-Only","DVR (800) Inband/No Crossband; For APX (VHF+700) using Unknown or User-Defined Antenna",4,5,1,2,1182,6,2,"No Drawing",""]
[null,"X",null,null,null,null,null,"X",null,800,"X",null,"X",null,"SINGLE","XB-Only","DVR (800) Crossband/No Inband; For APX (VHF+700) using Single-Band Antenna(s)",4,5,3,0,1186,12,2,"8J087X51-47",""]
[null,null,"X",null,null,null,null,null,null,800,"X",null,"X",null,"ALL","XB-Only","DVR (800) Crossband/No Inband; For APX (VHF+700) using One All-Band Antenna",4,5,3,1,1187,3,2,"8J087X51-05",""]
[null,null,"X",null,null,null,null,null,null,800,"X",null,"X",null,"USER","XB-Only","DVR (800) Crossband/No Inband; For APX (VHF+700) using Unknown or User-Defined Antenna",4,5,3,2,1188,3,2,"No Drawing",""]
[null,"X",null,null,null,"X",null,null,null,800,"X",null,"X",null,"SINGLE","IB+XB","DVR (800) Inband & Crossband; For APX (VHF+700) using Single-Band Antenna(s)",4,5,5,0,1192,8,2,"No Drawing",""]
[null,null,null,"X",null,"X",null,null,null,800,"X",null,"X",null,"ALL","IB+XB","DVR (800) Inband & Crossband; For APX (VHF+700) using One All-Band Antenna",4,5,5,1,1193,10,2,"8J087X51-29",""]
[null,null,null,"X",null,"X",null,null,null,800,"X",null,"X",null,"USER","IB+XB","DVR (800) Inband & Crossband; For APX (VHF+700) using Unknown or User-Defined Antenna",4,5,5,2,1194,10,2,"No Drawing",""]
[null,"X",null,null,null,"X",null,null,null,800,null,"X","X",null,"SINGLE","IB-Only","DVR (800) Inband/No Crossband; For APX (UHF+700) using Single-Band Antenna(s)",4,6,1,0,1197,8,2,"No Drawing",""]
[null,null,null,null,null,"X",null,null,null,800,null,"X","X",null,"ALL","IB-Only","DVR (800) Inband/No Crossband; For APX (UHF+700) using One All-Band Antenna",4,6,1,1,1198,6,2,"No Drawing",""]
[null,null,null,null,null,"X",null,null,null,800,null,"X","X",null,"USER","IB-Only","DVR (800) Inband/No Crossband; For APX (UHF+700) using Unknown or User-Defined Antenna",4,6,1,2,1199,6,2,"No Drawing",""]
[null,"X",null,null,null,null,null,"X",null,800,null,"X","X",null,"SINGLE","XB-Only","DVR (800) Crossband/No Inband; For APX (UHF+700) using Single-Band Antenna(s)",4,6,3,0,1203,12,2,"8J087X51-48",""]
[null,null,"X",null,null,null,null,null,null,800,null,"X","X",null,"ALL","XB-Only","DVR (800) Crossband/No Inband; For APX (UHF+700) using One All-Band Antenna",4,6,3,1,1204,3,2,"8J087X51-06",""]
[null,null,"X",null,null,null,null,null,null,800,null,"X","X",null,"USER","XB-Only","DVR (800) Crossband/No Inband; For APX (UHF+700) using Unknown or User-Defined Antenna",4,6,3,2,1205,3,2,"No Drawing",""]
[null,"X",null,null,null,"X",null,null,null,800,null,"X","X",null,"SINGLE","IB+XB","DVR (800) Inband & Crossband; For APX (UHF+700) using Single-Band Antenna(s)",4,6,5,0,1209,8,2,"No Drawing",""]
[null,null,null,"X",null,"X",null,null,null,800,null,"X","X",null,"ALL","IB+XB","DVR (800) Inband & Crossband; For APX (UHF+700) using One All-Band Antenna",4,6,5,1,1210,10,2,"8J087X51-30",""]
[null,null,null,"X",null,"X",null,null,null,800,null,"X","X",null,"USER","IB+XB",{"$f":"$J$6&\"(\"&$J327&\")\"&\" \"&VLOOKUP($P327,RPTCodes,2,FALSE) &\"; For APX (\"&VLOOKUP($S327,BAND_NAMES,2)&\") using \"&VLOOKUP($O327,ANTcodes,3,FALSE)","v":"DVR (800) Inband & Crossband; For APX (UHF+700) using Unknown or User-Defined Antenna"},{"$f":"VLOOKUP(J327,Freq_Bands,2)","v":4},{"$f":"IF(K327=\"X\",1,0)+IF(L327=\"X\",2,0)+IF(M327=\"X\",4,0)+IF(N327=\"X\",8,0)","v":6},{"$f":"VLOOKUP(P327,RPTCodes,4,FALSE)","v":5},{"$f":"VLOOKUP(O327,ANTcodes,2,FALSE)","v":2},{"$f":"$U327*MULT_ANT+$T327*MULT_RPT+$S327*MULT_MRF+$R327*MULT_VRF","v":1211},{"$f":"IF($A327=\"X\",1,0)+IF($B327=\"X\",2,0)+IF($C327=\"X\",3,0)+IF($D327=\"X\",4,0)+IF($E327=\"X\",5,0)+IF($F327=\"X\",6,0)+IF($H327=\"X\",10,0)","v":10},{"$f":"COUNTA(K327:L327)+IF(RIGHT(M327&N327,1)=\"X\",1,0)","v":2},"No Drawing",{"$f":"IF(COUNTIF($A327:$H327, \"<>\"&\"\")=0,\"INVALID COMBO\",\"\")","v":""}]
[null,"X",null,null,null,"X",null,null,null,800,"X","X","X",null,"SINGLE","IB-Only","DVR (800) Inband/No Crossband; For APX (VHF+UHF+700) using Single-Band Antenna(s)",4,7,1,0,1214,8,3,"No Drawing",""]
[null,null,null,null,null,"X",null,null,null,800,"X","X","X",null,"ALL","IB-Only","DVR (800) Inband/No Crossband; For APX (VHF+UHF+700) using One All-Band Antenna",4,7,1,1,1215,6,3,"No Drawing",""]
[null,null,null,null,null,"X",null,null,null,800,"X","X","X",null,"USER","IB-Only","DVR (800) Inband/No Crossband; For APX (VHF+UHF+700) using Unknown or User-Defined Antenna",4,7,1,2,1216,6,3,"No Drawing",""]
[null,"X",null,null,null,null,null,"X",null,800,"X","X","X",null,"SINGLE","XB-Only","DVR (800) Crossband/No Inband; For APX (VHF+UHF+700) using Single-Band Antenna(s)",4,7,3,0,1220,12,3,"8J087X51-57",""]
[null,null,null,null,"X",null,null,null,null,800,"X","X","X",null,"ALL","XB-Only","DVR (800) Crossband/No Inband; For APX (VHF+UHF+700) using One All-Band Antenna",4,7,3,1,1221,5,3,"8J087X51-39",""]
[null,null,null,null,"X",null,null,null,null,800,"X","X","X",null,"USER","XB-Only","DVR (800) Crossband/No Inband; For APX (VHF+UHF+700) using Unknown or User-Defined Antenna",4,7,3,2,1222,5,3,"No Drawing",""]
[null,"X",null,null,null,"X",null,null,null,800,"X","X","X",null,"SINGLE","IB+XB","DVR (800) Inband & Crossband; For APX (VHF+UHF+700) using Single-Band Antenna(s)",4,7,5,0,1226,8,3,"No Drawing",""]
[null,null,null,"X",null,"X",null,null,null,800,"X","X","X",null,"ALL","IB+XB","DVR (800) Inband & Crossband; For APX (VHF+UHF+700) using One All-Band Antenna",4,7,5,1,1227,10,3,"8J087X51-36",""]
[null,null,null,"X",null,"X",null,null,null,800,"X","X","X",null,"USER","IB+XB","DVR (800) Inband & Crossband; For APX (VHF+UHF+700) using Unknown or User-Defined Antenna",4,7,5,2,1228,10,3,"No Drawing",""]
["X",null,null,null,null,"X",null,null,null,800,null,null,null,"X","SINGLE","IB-Forced","DVR (800) Inband; For APX (800) using Single-Band Antenna(s)",4,8,2,0,1234,7,1,"No Drawing",""]
["X",null,null,null,null,"X",null,null,null,800,null,null,null,"X","ALL","IB-Forced","DVR (800) Inband; For APX (800) using One All-Band Antenna",4,8,2,1,1235,7,1,"No Drawing",""]
["X",null,null,null,null,"X",null,null,null,800,null,null,null,"X","USER","IB-Forced","DVR (800) Inband; For APX (800) using Unknown or User-Defined Antenna",4,8,2,2,1236,7,1,"No Drawing",""]
[null,null,null,null,null,null,null,null,"INVALID COMBO",800,null,null,null,"X","SINGLE","XB-Only","DVR (800) Crossband/No Inband; For APX (800) using Single-Band Antenna(s)",4,8,3,0,1237,0,1,"No Drawing","INVALID COMBO"]
[null,null,null,null,null,null,null,null,"INVALID COMBO",800,null,null,null,"X","ALL","XB-Only","DVR (800) Crossband/No Inband; For APX (800) using One All-Band Antenna",4,8,3,1,1238,0,1,"No Drawing","INVALID COMBO"]
[null,null,null,null,null,null,null,null,"INVALID COMBO",800,null,null,null,"X","USER","XB-Only","DVR (800) Crossband/No Inband; For APX (800) using Unknown or User-Defined Antenna",4,8,3,2,1239,0,1,"No Drawing","INVALID COMBO"]
[null,"X",null,null,null,"X",null,null,null,800,"X",null,null,"X","SINGLE","IB-Only","DVR (800) Inband/No Crossband; For APX (VHF+800) using Single-Band Antenna(s)",4,9,1,0,1248,8,2,"No Drawing",""]
[null,null,null,null,null,"X",null,null,null,800,"X",null,null,"X","ALL","IB-Only","DVR (800) Inband/No Crossband; For APX (VHF+800) using One All-Band Antenna",4,9,1,1,1249,6,2,"No Drawing",""]
[null,null,null,null,null,"X",null,null,null,800,"X",null,null,"X","USER","IB-Only","DVR (800) Inband/No Crossband; For APX (VHF+800) using Unknown or User-Defined Antenna",4,9,1,2,1250,6,2,"No Drawing",""]
[null,"X",null,null,null,null,null,"X",null,800,"X",null,null,"X","SINGLE","XB-Only","DVR (800) Crossband/No Inband; For APX (VHF+800) using Single-Band Antenna(s)",4,9,3,0,1254,12,2,"8J087X51-47",""]
[null,null,"X",null,null,null,null,null,null,800,"X",null,null,"X","ALL","XB-Only","DVR (800) Crossband/No Inband; For APX (VHF+800) using One All-Band Antenna",4,9,3,1,1255,3,2,"8J087X51-05",""]
[null,null,"X",null,null,null,null,null,null,800,"X",null,null,"X","USER","XB-Only","DVR (800) Crossband/No Inband; For APX (VHF+800) using Unknown or User-Defined Antenna",4,9,3,2,1256,3,2,"No Drawing",""]
[null,"X",null,null,null,"X",null,null,null,800,"X",null,null,"X","SINGLE","IB+XB","DVR (800) Inband & Crossband; For APX (VHF+800) using Single-Band Antenna(s)",4,9,5,0,1260,8,2,"No Drawing",""]
[null,null,null,"X",null,"X",null,null,null,800,"X",null,null,"X","ALL","IB+XB","DVR (800) Inband & Crossband; For APX (VHF+800) using One All-Band Antenna",4,9,5,1,1261,10,2,"8J087X51-29",""]
[null,null,null,"X",null,"X",null,null,null,800,"X",null,null,"X","USER","IB+XB","DVR (800) Inband & Crossband; For APX (VHF+800) using Unknown or User-Defined Antenna",4,9,5,2,1262,10,2,"No Drawing",""]
[null,"X",null,null,null,"X",null,null,null,800,null,"X",null,"X","SINGLE","IB-Only","DVR (800) Inband/No Crossband; For APX (UHF+800) using Single-Band Antenna(s)",4,10,1,0,1265,8,2,"No Drawing",""]
[null,null,null,null,null,"X",null,null,null,800,null,"X",null,"X","ALL","IB-Only","DVR (800) Inband/No Crossband; For APX (UHF+800) using One All-Band Antenna",4,10,1,1,1266,6,2,"No Drawing",""]
[null,null,null,null,null,"X",null,null,null,800,null,"X",null,"X","USER","IB-Only","DVR (800) Inband/No Crossband; For APX (UHF+800) using Unknown or User-Defined Antenna",4,10,1,2,1267,6,2,"No Drawing",""]
[null,"X",null,null,null,null,null,"X",null,800,null,"X",null,"X","SINGLE","XB-Only","DVR (800) Crossband/No Inband; For APX (UHF+800) using Single-Band Antenna(s)",4,10,3,0,1271,12,2,"8J087X51-48",""]
[null,null,"X",null,null,null,null,null,null,800,null,"X",null,"X","ALL","XB-Only","DVR (800) Crossband/No Inband; For APX (UHF+800) using One All-Band Antenna",4,10,3,1,1272,3,2,"8J087X51-06",""]
[null,null,"X",null,null,null,null,null,null,800,null,"X",null,"X","USER","XB-Only","DVR (800) Crossband/No Inband; For APX (UHF+800) using Unknown or User-Defined Antenna",4,10,3,2,1273,3,2,"No Drawing",""]
[null,"X",null,null,null,"X",null,null,null,800,null,"X",null,"X","SINGLE","IB+XB","DVR (800) Inband & Crossband; For APX (UHF+800) using Single-Band Antenna(s)",4,10,5,0,1277,8,2,"No Drawing",""]
[null,null,null,"X",null,"X",null,null,null,800,null,"X",null,"X","ALL","IB+XB","DVR (800) Inband & Crossband; For APX (UHF+800) using One All-Band Antenna",4,10,5,1,1278,10,2,"8J087X51-30",""]
[null,null,null,"X",null,"X",null,null,null,800,null,"X",null,"X","USER","IB+XB","DVR (800) Inband & Crossband; For APX (UHF+800) using Unknown or User-Defined Antenna",4,10,5,2,1279,10,2,"No Drawing",""]
[null,"X",null,null,null,"X",null,null,null,800,"X","X",null,"X","SINGLE","IB-Only","DVR (800) Inband/No Crossband; For APX (VHF+UHF+800) using Single-Band Antenna(s)",4,11,1,0,1282,8,3,"No Drawing",""]
[null,null,null,null,null,"X",null,null,null,800,"X","X",null,"X","ALL","IB-Only","DVR (800) Inband/No Crossband; For APX (VHF+UHF+800) using One All-Band Antenna",4,11,1,1,1283,6,3,"No Drawing",""]
[null,null,null,null,null,"X",null,null,null,800,"X","X",null,"X","USER","IB-Only","DVR (800) Inband/No Crossband; For APX (VHF+UHF+800) using Unknown or User-Defined Antenna",4,11,1,2,1284,6,3,"No Drawing",""]
[null,"X",null,null,null,null,null,"X",null,800,"X","X",null,"X","SINGLE","XB-Only","DVR (800) Crossband/No Inband; For APX (VHF+UHF+800) using Single-Band Antenna(s)",4,11,3,0,1288,12,3,"8J087X51-57",""]
[null,null,null,null,"X",null,null,null,null,800,"X","X",null,"X","ALL","XB-Only","DVR (800) Crossband/No Inband; For APX (VHF+UHF+800) using One All-Band Antenna",4,11,3,1,1289,5,3,"8J087X51-39",""]
[null,null,null,null,"X",null,null,null,null,800,"X","X",null,"X","USER","XB-Only","DVR (800) Crossband/No Inband; For APX (VHF+UHF+800) using Unknown or User-Defined Antenna",4,11,3,2,1290,5,3,"No Drawing",""]
[null,"X",null,null,null,"X",null,null,null,800,"X","X",null,"X","SINGLE","IB+XB","DVR (800) Inband & Crossband; For APX (VHF+UHF+800) using Single-Band Antenna(s)",4,11,5,0,1294,8,3,"No Drawing",""]
[null,null,null,"X",null,"X",null,null,null,800,"X","X",null,"X","ALL","IB+XB","DVR (800) Inband & Crossband; For APX (VHF+UHF+800) using One All-Band Antenna",4,11,5,1,1295,10,3,"8J087X51-36",""]
[null,null,null,"X",null,"X",null,null,null,800,"X","X",null,"X","USER","IB+XB","DVR (800) Inband & Crossband; For APX (VHF+UHF+800) using Unknown or User-Defined Antenna",4,11,5,2,1296,10,3,"No Drawing",""]
["X",null,null,null,null,"X",null,null,null,800,null,null,"X","X","SINGLE","IB-Forced","DVR (800) Inband; For APX (700+800) using Single-Band Antenna(s)",4,12,2,0,1302,7,1,"No Drawing",""]
["X",null,null,null,null,"X",null,null,null,800,null,null,"X","X","ALL","IB-Forced","DVR (800) Inband; For APX (700+800) using One All-Band Antenna",4,12,2,1,1303,7,1,"No Drawing",""]
["X",null,null,null,null,"X",null,null,null,800,null,null,"X","X","USER","IB-Forced","DVR (800) Inband; For APX (700+800) using Unknown or User-Defined Antenna",4,12,2,2,1304,7,1,"No Drawing",""]
[null,null,null,null,null,null,null,null,"INVALID COMBO",800,null,null,"X","X","SINGLE","XB-Only","DVR (800) Crossband/No Inband; For APX (700+800) using Single-Band Antenna(s)",4,12,3,0,1305,0,1,"No Drawing","INVALID COMBO"]
[null,null,null,null,null,null,null,null,"INVALID COMBO",800,null,null,"X","X","ALL","XB-Only","DVR (800) Crossband/No Inband; For APX (700+800) using One All-Band Antenna",4,12,3,1,1306,0,1,"No Drawing","INVALID COMBO"]
[null,null,null,null,null,null,null,null,"INVALID COMBO",800,null,null,"X","X","USER","XB-Only","DVR (800) Crossband/No Inband; For APX (700+800) using Unknown or User-Defined Antenna",4,12,3,2,1307,0,1,"No Drawing","INVALID COMBO"]
[null,"X",null,null,null,"X",null,null,null,800,"X",null,"X","X","SINGLE","IB-Only","DVR (800) Inband/No Crossband; For APX (VHF+700+800) using Single-Band Antenna(s)",4,13,1,0,1316,8,2,"No Drawing",""]
[null,null,null,null,null,"X",null,null,null,800,"X",null,"X","X","ALL","IB-Only","DVR (800) Inband/No Crossband; For APX (VHF+700+800) using One All-Band Antenna",4,13,1,1,1317,6,2,"No Drawing",""]
[null,null,null,null,null,"X",null,null,null,800,"X",null,"X","X","USER","IB-Only","DVR (800) Inband/No Crossband; For APX (VHF+700+800) using Unknown or User-Defined Antenna",4,13,1,2,1318,6,2,"No Drawing",""]
[null,"X",null,null,null,null,null,"X",null,800,"X",null,"X","X","SINGLE","XB-Only","DVR (800) Crossband/No Inband; For APX (VHF+700+800) using Single-Band Antenna(s)",4,13,3,0,1322,12,2,"8J087X51-47",""]
[null,null,"X",null,null,null,null,null,null,800,"X",null,"X","X","ALL","XB-Only","DVR (800) Crossband/No Inband; For APX (VHF+700+800) using One All-Band Antenna",4,13,3,1,1323,3,2,"8J087X51-05",""]
[null,null,"X",null,null,null,null,null,null,800,"X",null,"X","X","USER","XB-Only","DVR (800) Crossband/No Inband; For APX (VHF+700+800) using Unknown or User-Defined Antenna",4,13,3,2,1324,3,2,"No Drawing",""]
[null,"X",null,null,null,"X",null,null,null,800,"X",null,"X","X","SINGLE","IB+XB","DVR (800) Inband & Crossband; For APX (VHF+700+800) using Single-Band Antenna(s)",4,13,5,0,1328,8,2,"No Drawing",""]
[null,null,null,"X",null,"X",null,null,null,800,"X",null,"X","X","ALL","IB+XB","DVR (800) Inband & Crossband; For APX (VHF+700+800) using One All-Band Antenna",4,13,5,1,1329,10,2,"8J087X51-29",""]
[null,null,null,"X",null,"X",null,null,null,800,"X",null,"X","X","USER","IB+XB","DVR (800) Inband & Crossband; For APX (VHF+700+800) using Unknown or User-Defined Antenna",4,13,5,2,1330,10,2,"No Drawing",""]
[null,"X",null,null,null,"X",null,null,null,800,null,"X","X","X","SINGLE","IB-Only","DVR (800) Inband/No Crossband; For APX (UHF+700+800) using Single-Band Antenna(s)",4,14,1,0,1333,8,2,"No Drawing",""]
[null,null,null,null,null,"X",null,null,null,800,null,"X","X","X","ALL","IB-Only","DVR (800) Inband/No Crossband; For APX (UHF+700+800) using One All-Band Antenna",4,14,1,1,1334,6,2,"No Drawing",""]
[null,null,null,null,null,"X",null,null,null,800,null,"X","X","X","USER","IB-Only","DVR (800) Inband/No Crossband; For APX (UHF+700+800) using Unknown or User-Defined Antenna",4,14,1,2,1335,6,2,"No Drawing",""]
[null,"X",null,null,null,null,null,"X",null,800,null,"X","X","X","SINGLE","XB-Only","DVR (800) Crossband/No Inband; For APX (UHF+700+800) using Single-Band Antenna(s)",4,14,3,0,1339,12,2,"8J087X51-48",""]
[null,null,"X",null,null,null,null,null,null,800,null,"X","X","X","ALL","XB-Only","DVR (800) Crossband/No Inband; For APX (UHF+700+800) using One All-Band Antenna",4,14,3,1,1340,3,2,"8J087X51-06",""]
[null,null,"X",null,null,null,null,null,null,800,null,"X","X","X","USER","XB-Only","DVR (800) Crossband/No Inband; For APX (UHF+700+800) using Unknown or User-Defined Antenna",4,14,3,2,1341,3,2,"No Drawing",""]
[null,"X",null,null,null,"X",null,null,null,800,null,"X","X","X","SINGLE","IB+XB",{"$f":"$J$6&\"(\"&$J391&\")\"&\" \"&VLOOKUP($P391,RPTCodes,2,FALSE) &\"; For APX (\"&VLOOKUP($S391,BAND_NAMES,2)&\") using \"&VLOOKUP($O391,ANTcodes,3,FALSE)","v":"DVR (800) Inband & Crossband; For APX (UHF+700+800) using Single-Band Antenna(s)"},{"$f":"VLOOKUP(J391,Freq_Bands,2)","v":4},{"$f":"IF(K391=\"X\",1,0)+IF(L391=\"X\",2,0)+IF(M391=\"X\",4,0)+IF(N391=\"X\",8,0)","v":14},{"$f":"VLOOKUP(P391,RPTCodes,4,FALSE)","v":5},{"$f":"VLOOKUP(O391,ANTcodes,2,FALSE)","v":0},{"$f":"$U391*MULT_ANT+$T391*MULT_RPT+$S391*MULT_MRF+$R391*MULT_VRF","v":1345},{"$f":"IF($A391=\"X\",1,0)+IF($B391=\"X\",2,0)+IF($C391=\"X\",3,0)+IF($D391=\"X\",4,0)+IF($E391=\"X\",5,0)+IF($F391=\"X\",6,0)+IF($H391=\"X\",10,0)","v":8},{"$f":"COUNTA(K391:L391)+IF(RIGHT(M391&N391,1)=\"X\",1,0)","v":2},"No Drawing",{"$f":"IF(COUNTIF($A391:$H391, \"<>\"&\"\")=0,\"INVALID COMBO\",\"\")","v":""}]
[null,null,null,"X",null,"X",null,null,null,800,null,"X","X","X","ALL","IB+XB","DVR (800) Inband & Crossband; For APX (UHF+700+800) using One All-Band Antenna",4,14,5,1,1346,10,2,"8J087X51-30",""]
[null,null,null,"X",null,"X",null,null,null,800,null,"X","X","X","USER","IB+XB","DVR (800) Inband & Crossband; For APX (UHF+700+800) using Unknown or User-Defined Antenna",4,14,5,2,1347,10,2,"No Drawing",""]
[null,"X",null,null,null,"X",null,null,null,800,"X","X","X","X","SINGLE","IB-Only","DVR (800) Inband/No Crossband; For APX (VHF+UHF+700+800) using Single-Band Antenna(s)",4,15,1,0,1350,8,3,"No Drawing",""]
[null,null,null,null,null,"X",null,null,null,800,"X","X","X","X","ALL","IB-Only","DVR (800) Inband/No Crossband; For APX (VHF+UHF+700+800) using One All-Band Antenna",4,15,1,1,1351,6,3,"No Drawing",""]
[null,null,null,null,null,"X",null,null,null,800,"X","X","X","X","USER","IB-Only","DVR (800) Inband/No Crossband; For APX (VHF+UHF+700+800) using Unknown or User-Defined Antenna",4,15,1,2,1352,6,3,"No Drawing",""]
[null,"X",null,null,null,null,null,"X",null,800,"X","X","X","X","SINGLE","XB-Only","DVR (800) Crossband/No Inband; For APX (VHF+UHF+700+800) using Single-Band Antenna(s)",4,15,3,0,1356,12,3,"8J087X51-57",""]
[null,null,null,null,"X",null,null,null,null,800,"X","X","X","X","ALL","XB-Only","DVR (800) Crossband/No Inband; For APX (VHF+UHF+700+800) using One All-Band Antenna",4,15,3,1,1357,5,3,"8J087X51-39",""]
[null,null,null,null,"X",null,null,null,null,800,"X","X","X","X","USER","XB-Only","DVR (800) Crossband/No Inband; For APX (VHF+UHF+700+800) using Unknown or User-Defined Antenna",4,15,3,2,1358,5,3,"No Drawing",""]
[null,"X",null,null,null,"X",null,null,null,800,"X","X","X","X","SINGLE","IB+XB","DVR (800) Inband & Crossband; For APX (VHF+UHF+700+800) using Single-Band Antenna(s)",4,15,5,0,1362,8,3,"No Drawing",""]
[null,null,null,"X",null,"X",null,null,null,800,"X","X","X","X","ALL","IB+XB","DVR (800) Inband & Crossband; For APX (VHF+UHF+700+800) using One All-Band Antenna",4,15,5,1,1363,10,3,"8J087X51-36",""]
[null,null,null,"X",null,"X",null,null,null,800,"X","X","X","X","USER","IB+XB","DVR (800) Inband & Crossband; For APX (VHF+UHF+700+800) using Unknown or User-Defined Antenna",4,15,5,2,1364,10,3,"No Drawing",""]

{"sheet":"DVR Suitcase","index":6,"n_rows":402,"n_cols":30,"rows_kept":402,"cut":false,"hidden":true,"merged":[[2,7,2,8]]}
[null,null,null,null,null,null,null,null,null,"DVRS-SUITCASE FILTERING CONFIGURATOR",null,null,null,null,null,null,"Note: Suitcase Internal triplexing is NOT possible. RF SWITCH can ONLY be used with IN-BAND Filtering"]
["SOLUTIONS REQUIRED"]
[null,"Kit-6","XB-1","Kit-2","Kit-7","KIT-4","KIT-0","Kit-5",null,"DVR",null,null,null,null,null,null,null,null,"Lookup/Sorting Codes",null,null,null,null,"FilterCode"]
[1,19,23,3,20,5,6," ",10,0,"DVR","MSU FREQUENCY BANDS USED",null,null,null,"MSU "]
[null,"TRIPLEXER SOLUTION",null,null,null,null,"STANDARD","OPTION","Required","NOTES","BAND","b1","b2","b3a","b3b","ANT","REPEAT",null,4,16,4,2]
["NONE","1x (SC)","1XB","1x+Relay","2x (SC)","2x+Relay","In-BAND","Relay","Relay","NOTES","SUITCASE-DVRS","VHF","UHF",700,800,"MSU-Ant","TYPE","DESCRIPTION","VRF","MRF","RPT","ANT","TOTAl","FL","NumBands","Drawing","OLD FL","Other Notes"]
["X",null,null,null,null,null,"X",null,null,{"$f":"IF(OR(AND(Y7>2,$P7<>\"All\"),$P7=\"USER\",$Q7=\"XB-Only\"),\"INVALID COMBO\",\"\")","v":"INVALID COMBO"},"VHF","X",null,null,null,"USER","IB-Forced",{"$f":"$K$6&\"(\"&$K7&\")\"&\" \"&VLOOKUP($Q7,RPTCodes,2,FALSE) &\"; For APX (\"&VLOOKUP($T7,BAND_NAMES,2)&\") using \"&VLOOKUP($P7,ANTcodes,3,FALSE)","v":"SUITCASE-DVRS(VHF) Inband; For APX (VHF) using Unknown or User-Defined Antenna"},{"$f":"VLOOKUP(K7,Freq_Bands,2)","v":1},{"$f":"IF(L7=\"X\",1,0)+IF(M7=\"X\",2,0)+IF(N7=\"X\",4,0)+IF(O7=\"X\",8,0)","v":1},{"$f":"VLOOKUP(Q7,RPTCodes,4,FALSE)","v":2},{"$f":"VLOOKUP(P7,ANTcodes,2,FALSE)","v":2},{"$f":"$V7*MULT_ANT+$U7*MULT_RPT+$T7*MULT_MRF+$S7*MULT_VRF","v":298},{"$f":"IF(LEFT($J7,4)=\"INVA\",$J$4,IF($A7=\"X\",$A$4,0)+IF($B7=\"X\",$B$4,0)+IF($D7=\"X\",$D$4,0)+IF($E7=\"X\",$E$4,0)+IF($F7=\"X\",$F$4,0)+IF($G7=\"X\",$G$4,0)+IF($I7=\"X\",$I$4,0)+IF($C7=\"X\",$C$4,0))","v":0},{"$f":"COUNTA(L7:M7)+IF(RIGHT(N7&O7,1)=\"X\",1,0)","v":1},"No Drawing",7,"Single MSU Band",{"$f":"IF(COUNTIF($A7:$H7, \"<>\"&\"\")=0,\"INVALID COMBO\",\"\")","v":""}]
[null,null,null,null,null,null,null,null,null,"INVALID COMBO","VHF","X",null,null,null,"SINGLE","XB-Only","SUITCASE-DVRS(VHF) Crossband/No Inband; For APX (VHF) using Single-Band Antenna(s)",1,1,3,0,299,0,1,"No Drawing",0,"Illogical terminology","INVALID COMBO","INVALID COMBO"]
[null,null,null,null,null,null,null,null,null,"INVALID COMBO","VHF","X",null,null,null,"ALL","XB-Only","SUITCASE-DVRS(VHF) Crossband/No Inband; For APX (VHF) using One All-Band Antenna",1,1,3,1,300,0,1,"No Drawing",0,"Illogical terminology","INVALID COMBO","INVALID COMBO"]
[null,null,null,null,null,null,null,null,null,"INVALID COMBO","VHF","X",null,null,null,"USER","XB-Only","SUITCASE-DVRS(VHF) Crossband/No Inband; For APX (VHF) using Unknown or User-Defined Antenna",1,1,3,2,301,0,1,"No Drawing",0,"Illogical terminology","INVALID COMBO","INVALID COMBO"]
[null,"X",null,null,null,null,null,null,null,"","VHF",null,"X",null,null,"SINGLE","XB-Forced","SUITCASE-DVRS(VHF) Crossband; For APX (UHF) using Single-Band Antenna(s)",1,2,4,0,319,19,1,"No Drawing",2,"Single MSU Band",""]
[null,"X",null,null,null,null,null,null,null,"","VHF",null,"X",null,null,"ALL","XB-Forced","SUITCASE-DVRS(VHF) Crossband; For APX (UHF) using One All-Band Antenna",1,2,4,1,320,19,1,"No Drawing",2,"Single MSU Band",""]
[null,"X",null,null,null,null,null,null,null,"INVALID COMBO","VHF",null,"X",null,null,"USER","XB-Forced","SUITCASE-DVRS(VHF) Crossband; For APX (UHF) using Unknown or User-Defined Antenna",1,2,4,2,321,0,1,"No Drawing",2,null,""]
[null,null,null,null,null,null,"X",null,null,"INVALID COMBO","VHF","X","X",null,null,"USER","IB-Only","SUITCASE-DVRS(VHF) Inband/No Crossband; For APX (VHF+UHF) using Unknown or User-Defined Antenna",1,3,1,2,329,0,2,"No Drawing",6,null,""]
[null,"X",null,null,null,null,null,null,"X","INVALID COMBO","VHF","X","X",null,null,"SINGLE","XB-Only","SUITCASE-DVRS(VHF) Crossband/No Inband; For APX (VHF+UHF) using Single-Band Antenna(s)",1,3,3,0,333,0,2,"No Drawing",18,"Original Special Order","","Special Order"]
[null,null,null,"X",null,null,null,null,null,"INVALID COMBO","VHF","X","X",null,null,"ALL","XB-Only","SUITCASE-DVRS(VHF) Crossband/No Inband; For APX (VHF+UHF) using One All-Band Antenna",1,3,3,1,334,0,2,"No Drawing",18,"Original Special Order","","Special Order"]
[null,null,null,"X",null,null,null,null,null,"INVALID COMBO","VHF","X","X",null,null,"USER","XB-Only","SUITCASE-DVRS(VHF) Crossband/No Inband; For APX (VHF+UHF) using Unknown or User-Defined Antenna",1,3,3,2,335,0,2,"No Drawing",18,null,"","Special Order"]
[null,null,null,null,"X",null,"X",null,null,"INVALID COMBO","VHF","X","X",null,null,"USER","IB+XB","SUITCASE-DVRS(VHF) Inband & Crossband; For APX (VHF+UHF) using Unknown or User-Defined Antenna",1,3,5,2,341,0,2,"No Drawing",10,null,""]
[null,"X",null,null,null,null,null,null,null,"","VHF",null,null,"X",null,"SINGLE","XB-Forced","SUITCASE-DVRS(VHF) Crossband; For APX (700) using Single-Band Antenna(s)",1,4,4,0,353,19,1,"No Drawing",2,"Single MSU Band",""]
[null,"X",null,null,null,null,null,null,null,"","VHF",null,null,"X",null,"ALL","XB-Forced","SUITCASE-DVRS(VHF) Crossband; For APX (700) using One All-Band Antenna",1,4,4,1,354,19,1,"No Drawing",2,"Single MSU Band",""]
[null,"X",null,null,null,null,null,null,null,"INVALID COMBO","VHF",null,null,"X",null,"USER","XB-Forced","SUITCASE-DVRS(VHF) Crossband; For APX (700) using Unknown or User-Defined Antenna",1,4,4,2,355,0,1,"No Drawing",2,null,""]
[null,null,null,null,null,null,"X",null,null,"INVALID COMBO","VHF","X",null,"X",null,"USER","IB-Only","SUITCASE-DVRS(VHF) Inband/No Crossband; For APX (VHF+700) using Unknown or User-Defined Antenna",1,5,1,2,363,0,2,"No Drawing",6,null,""]
[null,"X",null,null,null,null,null,null,"X","INVALID COMBO","VHF","X",null,"X",null,"SINGLE","XB-Only","SUITCASE-DVRS(VHF) Crossband/No Inband; For APX (VHF+700) using Single-Band Antenna(s)",1,5,3,0,367,0,2,"No Drawing",18,"Original Special Order","","Special Order"]
[null,null,null,"X",null,null,null,null,null,"INVALID COMBO","VHF","X",null,"X",null,"ALL","XB-Only","SUITCASE-DVRS(VHF) Crossband/No Inband; For APX (VHF+700) using One All-Band Antenna",1,5,3,1,368,0,2,"No Drawing",18,"Original Special Order","","Special Order"]
[null,null,null,"X",null,null,null,null,null,"INVALID COMBO","VHF","X",null,"X",null,"USER","XB-Only","SUITCASE-DVRS(VHF) Crossband/No Inband; For APX (VHF+700) using Unknown or User-Defined Antenna",1,5,3,2,369,0,2,"No Drawing",18,null,"","Special Order"]
[null,null,null,null,"X",null,"X",null,null,"INVALID COMBO","VHF","X",null,"X",null,"USER","IB+XB","SUITCASE-DVRS(VHF) Inband & Crossband; For APX (VHF+700) using Unknown or User-Defined Antenna",1,5,5,2,375,0,2,"No Drawing",10,null,""]
[null,null,null,null,"X",null,null,null,null,"INVALID COMBO","VHF",null,"X","X",null,"USER","XB-Forced","SUITCASE-DVRS(VHF) Crossband; For APX (UHF+700) using Unknown or User-Defined Antenna",1,6,4,2,389,0,2,"No Drawing",4,null,""]
[null,null,null,null,null,null,null,null,null,"INVALID COMBO","VHF","X","X","X",null,"SINGLE","IB-Only","SUITCASE-DVRS(VHF) Inband/No Crossband; For APX (VHF+UHF+700) using Single-Band Antenna(s)",1,7,1,0,395,0,3,"No Drawing",8,"3-Band Single Antenna","INVALID COMBO"]
[null,null,null,null,null,null,"X",null,null,"INVALID COMBO","VHF","X","X","X",null,"USER","IB-Only","SUITCASE-DVRS(VHF) Inband/No Crossband; For APX (VHF+UHF+700) using Unknown or User-Defined Antenna",1,7,1,2,397,0,3,"No Drawing",6,null,""]
[null,null,null,null,null,null,null,null,null,"INVALID COMBO","VHF","X","X","X",null,"SINGLE","XB-Only","SUITCASE-DVRS(VHF) Crossband/No Inband; For APX (VHF+UHF+700) using Single-Band Antenna(s)",1,7,3,0,401,0,3,"No Drawing",18,"3-Band Single Antenna","INVALID COMBO","Special Order"]
[null,null,null,null,null,"X",null,null,null,"INVALID COMBO","VHF","X","X","X",null,"ALL","XB-Only","SUITCASE-DVRS(VHF) Crossband/No Inband; For APX (VHF+UHF+700) using One All-Band Antenna",1,7,3,1,402,0,3,"No Drawing",18,"Original Special Order","","Special Order"]
[null,null,null,null,null,"X",null,null,null,"INVALID COMBO","VHF","X","X","X",null,"USER","XB-Only","SUITCASE-DVRS(VHF) Crossband/No Inband; For APX (VHF+UHF+700) using Unknown or User-Defined Antenna",1,7,3,2,403,0,3,"No Drawing",18,null,"","Special Order"]
[null,null,null,null,null,null,null,null,null,"INVALID COMBO","VHF","X","X","X",null,"SINGLE","IB+XB","SUITCASE-DVRS(VHF) Inband & Crossband; For APX (VHF+UHF+700) using Single-Band Antenna(s)",1,7,5,0,407,0,3,"No Drawing",8,"3-Band Single Antenna","INVALID COMBO"]
[null,null,null,null,"X",null,"X",null,null,"INVALID COMBO","VHF","X","X","X",null,"USER","IB+XB","SUITCASE-DVRS(VHF) Inband & Crossband; For APX (VHF+UHF+700) using Unknown or User-Defined Antenna",1,7,5,2,409,0,3,"No Drawing",10,null,""]
[null,"X",null,null,null,null,null,null,null,"","VHF",null,null,null,"X","SINGLE","XB-Forced","SUITCASE-DVRS(VHF) Crossband; For APX (800) using Single-Band Antenna(s)",1,8,4,0,421,19,1,"No Drawing",2,"Single MSU Band",""]
[null,"X",null,null,null,null,null,null,null,"","VHF",null,null,null,"X","ALL","XB-Forced","SUITCASE-DVRS(VHF) Crossband; For APX (800) using One All-Band Antenna",1,8,4,1,422,19,1,"No Drawing",2,"Single MSU Band",""]
[null,"X",null,null,null,null,null,null,null,"INVALID COMBO","VHF",null,null,null,"X","USER","XB-Forced","SUITCASE-DVRS(VHF) Crossband; For APX (800) using Unknown or User-Defined Antenna",1,8,4,2,423,0,1,"No Drawing",2,null,""]
[null,null,null,null,null,null,"X",null,null,"INVALID COMBO","VHF","X",null,null,"X","USER","IB-Only","SUITCASE-DVRS(VHF) Inband/No Crossband; For APX (VHF+800) using Unknown or User-Defined Antenna",1,9,1,2,431,0,2,"No Drawing",6,null,""]
[null,"X",null,null,null,null,null,null,"X","INVALID COMBO","VHF","X",null,null,"X","SINGLE","XB-Only","SUITCASE-DVRS(VHF) Crossband/No Inband; For APX (VHF+800) using Single-Band Antenna(s)",1,9,3,0,435,0,2,"No Drawing",18,"Original Special Order","","Special Order"]
[null,null,null,"X",null,null,null,null,null,"INVALID COMBO","VHF","X",null,null,"X","ALL","XB-Only","SUITCASE-DVRS(VHF) Crossband/No Inband; For APX (VHF+800) using One All-Band Antenna",1,9,3,1,436,0,2,"No Drawing",18,"Original Special Order","","Special Order"]
[null,null,null,"X",null,null,null,null,null,"INVALID COMBO","VHF","X",null,null,"X","USER","XB-Only","SUITCASE-DVRS(VHF) Crossband/No Inband; For APX (VHF+800) using Unknown or User-Defined Antenna",1,9,3,2,437,0,2,"No Drawing",18,null,"","Special Order"]
[null,null,null,null,"X",null,"X",null,null,"INVALID COMBO","VHF","X",null,null,"X","USER","IB+XB","SUITCASE-DVRS(VHF) Inband & Crossband; For APX (VHF+800) using Unknown or User-Defined Antenna",1,9,5,2,443,0,2,"No Drawing",10,null,""]
[null,null,null,null,"X",null,null,null,null,"INVALID COMBO","VHF",null,"X",null,"X","USER","XB-Forced","SUITCASE-DVRS(VHF) Crossband; For APX (UHF+800) using Unknown or User-Defined Antenna",1,10,4,2,457,0,2,"No Drawing",4,null,""]
[null,null,null,null,null,null,null,null,null,"INVALID COMBO","VHF","X","X",null,"X","SINGLE","IB-Only","SUITCASE-DVRS(VHF) Inband/No Crossband; For APX (VHF+UHF+800) using Single-Band Antenna(s)",1,11,1,0,463,0,3,"No Drawing",8,"3-Band Single Antenna","INVALID COMBO"]
[null,null,null,null,null,null,"X",null,null,"INVALID COMBO","VHF","X","X",null,"X","USER","IB-Only","SUITCASE-DVRS(VHF) Inband/No Crossband; For APX (VHF+UHF+800) using Unknown or User-Defined Antenna",1,11,1,2,465,0,3,"No Drawing",6,null,""]
[null,null,null,null,null,null,null,null,null,"INVALID COMBO","VHF","X","X",null,"X","SINGLE","XB-Only","SUITCASE-DVRS(VHF) Crossband/No Inband; For APX (VHF+UHF+800) using Single-Band Antenna(s)",1,11,3,0,469,0,3,"No Drawing",18,"3-Band Single Antenna","INVALID COMBO","Special Order"]
[null,null,null,null,null,"X",null,null,null,"INVALID COMBO","VHF","X","X",null,"X","ALL","XB-Only","SUITCASE-DVRS(VHF) Crossband/No Inband; For APX (VHF+UHF+800) using One All-Band Antenna",1,11,3,1,470,0,3,"No Drawing",18,"Original Special Order","","Special Order"]
[null,null,null,null,null,"X",null,null,null,"INVALID COMBO","VHF","X","X",null,"X","USER","XB-Only","SUITCASE-DVRS(VHF) Crossband/No Inband; For APX (VHF+UHF+800) using Unknown or User-Defined Antenna",1,11,3,2,471,0,3,"No Drawing",18,null,"","Special Order"]
[null,null,null,null,null,null,null,null,null,"INVALID COMBO","VHF","X","X",null,"X","SINGLE","IB+XB","SUITCASE-DVRS(VHF) Inband & Crossband; For APX (VHF+UHF+800) using Single-Band Antenna(s)",1,11,5,0,475,0,3,"No Drawing",8,"3-Band Single Antenna","INVALID COMBO"]
[null,null,null,null,"X",null,"X",null,null,"INVALID COMBO","VHF","X","X",null,"X","USER","IB+XB","SUITCASE-DVRS(VHF) Inband & Crossband; For APX (VHF+UHF+800) using Unknown or User-Defined Antenna",1,11,5,2,477,0,3,"No Drawing",10,null,""]
[null,"X",null,null,null,null,null,null,null,"","VHF",null,null,"X","X","SINGLE","XB-Forced","SUITCASE-DVRS(VHF) Crossband; For APX (700+800) using Single-Band Antenna(s)",1,12,4,0,489,19,1,"No Drawing",2,"Single MSU Band",""]
[null,"X",null,null,null,null,null,null,null,"","VHF",null,null,"X","X","ALL","XB-Forced","SUITCASE-DVRS(VHF) Crossband; For APX (700+800) using One All-Band Antenna",1,12,4,1,490,19,1,"No Drawing",2,"Single MSU Band",""]
[null,"X",null,null,null,null,null,null,null,"INVALID COMBO","VHF",null,null,"X","X","USER","XB-Forced","SUITCASE-DVRS(VHF) Crossband; For APX (700+800) using Unknown or User-Defined Antenna",1,12,4,2,491,0,1,"No Drawing",2,null,""]
[null,null,null,null,null,null,"X",null,null,"INVALID COMBO","VHF","X",null,"X","X","USER","IB-Only","SUITCASE-DVRS(VHF) Inband/No Crossband; For APX (VHF+700+800) using Unknown or User-Defined Antenna",1,13,1,2,499,0,2,"No Drawing",6,null,""]
[null,"X",null,null,null,null,null,null,"X","INVALID COMBO","VHF","X",null,"X","X","SINGLE","XB-Only","SUITCASE-DVRS(VHF) Crossband/No Inband; For APX (VHF+700+800) using Single-Band Antenna(s)",1,13,3,0,503,0,2,"No Drawing",18,"Original Special Order","","Special Order"]
[null,null,null,"X",null,null,null,null,null,"INVALID COMBO","VHF","X",null,"X","X","ALL","XB-Only","SUITCASE-DVRS(VHF) Crossband/No Inband; For APX (VHF+700+800) using One All-Band Antenna",1,13,3,1,504,0,2,"No Drawing",18,"Original Special Order","","Special Order"]
[null,null,null,"X",null,null,null,null,null,"INVALID COMBO","VHF","X",null,"X","X","USER","XB-Only","SUITCASE-DVRS(VHF) Crossband/No Inband; For APX (VHF+700+800) using Unknown or User-Defined Antenna",1,13,3,2,505,0,2,"No Drawing",18,null,"","Special Order"]
[null,null,null,null,"X",null,"X",null,null,"INVALID COMBO","VHF","X",null,"X","X","USER","IB+XB","SUITCASE-DVRS(VHF) Inband & Crossband; For APX (VHF+700+800) using Unknown or User-Defined Antenna",1,13,5,2,511,0,2,"No Drawing",10,null,""]
[null,null,null,null,"X",null,null,null,null,"INVALID COMBO","VHF",null,"X","X","X","USER","XB-Forced","SUITCASE-DVRS(VHF) Crossband; For APX (UHF+700+800) using Unknown or User-Defined Antenna",1,14,4,2,525,0,2,"No Drawing",4,null,""]
[null,null,null,null,null,null,null,null,null,"INVALID COMBO","VHF","X","X","X","X","SINGLE","IB-Only","SUITCASE-DVRS(VHF) Inband/No Crossband; For APX (VHF+UHF+700+800) using Single-Band Antenna(s)",1,15,1,0,531,0,3,"No Drawing",8,"3-Band Single Antenna","INVALID COMBO"]
[null,null,null,null,null,null,"X",null,null,"INVALID COMBO","VHF","X","X","X","X","USER","IB-Only","SUITCASE-DVRS(VHF) Inband/No Crossband; For APX (VHF+UHF+700+800) using Unknown or User-Defined Antenna",1,15,1,2,533,0,3,"No Drawing",6,null,""]
[null,null,null,null,null,null,null,null,null,"INVALID COMBO","VHF","X","X","X","X","SINGLE","XB-Only","SUITCASE-DVRS(VHF) Crossband/No Inband; For APX (VHF+UHF+700+800) using Single-Band Antenna(s)",1,15,3,0,537,0,3,"No Drawing",18,"3-Band Single Antenna","INVALID COMBO","Special Order"]
[null,null,null,null,null,"X",null,null,null,"INVALID COMBO","VHF","X","X","X","X","ALL","XB-Only","SUITCASE-DVRS(VHF) Crossband/No Inband; For APX (VHF+UHF+700+800) using One All-Band Antenna",1,15,3,1,538,0,3,"No Drawing",18,"Original Special Order","","Special Order"]
[null,null,null,null,null,"X",null,null,null,"INVALID COMBO","VHF","X","X","X","X","USER","XB-Only","SUITCASE-DVRS(VHF) Crossband/No Inband; For APX (VHF+UHF+700+800) using Unknown or User-Defined Antenna",1,15,3,2,539,0,3,"No Drawing",18,null,"","Special Order"]
[null,null,null,null,null,null,null,null,null,"INVALID COMBO","VHF","X","X","X","X","SINGLE","IB+XB","SUITCASE-DVRS(VHF) Inband & Crossband; For APX (VHF+UHF+700+800) using Single-Band Antenna(s)",1,15,5,0,543,0,3,"No Drawing",8,"3-Band Single Antenna","INVALID COMBO"]
[null,null,null,null,"X",null,"X",null,null,"INVALID COMBO","VHF","X","X","X","X","USER","IB+XB","SUITCASE-DVRS(VHF) Inband & Crossband; For APX (VHF+UHF+700+800) using Unknown or User-Defined Antenna",1,15,5,2,545,0,3,"No Drawing",10,null,""]
[null,"X",null,null,null,null,null,null,null,"","UHF","X",null,null,null,"SINGLE","XB-Forced","SUITCASE-DVRS(UHF) Crossband; For APX (VHF) using Single-Band Antenna(s)",2,1,4,0,575,19,1,"No Drawing",2,"Single MSU Band",""]
[null,"X",null,null,null,null,null,null,null,"","UHF","X",null,null,null,"ALL","XB-Forced","SUITCASE-DVRS(UHF) Crossband; For APX (VHF) using One All-Band Antenna",2,1,4,1,576,19,1,"No Drawing",2,"Single MSU Band",""]
[null,"X",null,null,null,null,null,null,null,"INVALID COMBO","UHF","X",null,null,null,"USER","XB-Forced","SUITCASE-DVRS(UHF) Crossband; For APX (VHF) using Unknown or User-Defined Antenna",2,1,4,2,577,0,1,"No Drawing",2,"Single MSU Band",""]
["X",null,null,null,null,null,"X",null,null,"INVALID COMBO","UHF",null,"X",null,null,"USER","IB-Forced","SUITCASE-DVRS(UHF) Inband; For APX (UHF) using Unknown or User-Defined Antenna",2,2,2,2,588,0,1,"No Drawing",7,null,""]
[null,null,null,null,null,null,null,null,null,{"$f":"IF(OR(AND(Y71>2,$P71<>\"All\"),$P71=\"USER\",$Q71=\"XB-Only\"),\"INVALID COMBO\",\"\")","v":"INVALID COMBO"},"UHF",null,"X",null,null,"SINGLE","XB-Only",{"$f":"$K$6&\"(\"&$K71&\")\"&\" \"&VLOOKUP($Q71,RPTCodes,2,FALSE) &\"; For APX (\"&VLOOKUP($T71,BAND_NAMES,2)&\") using \"&VLOOKUP($P71,ANTcodes,3,FALSE)","v":"SUITCASE-DVRS(UHF) Crossband/No Inband; For APX (UHF) using Single-Band Antenna(s)"},{"$f":"VLOOKUP(K71,Freq_Bands,2)","v":2},{"$f":"IF(L71=\"X\",1,0)+IF(M71=\"X\",2,0)+IF(N71=\"X\",4,0)+IF(O71=\"X\",8,0)","v":2},{"$f":"VLOOKUP(Q71,RPTCodes,4,FALSE)","v":3},{"$f":"VLOOKUP(P71,ANTcodes,2,FALSE)","v":0},{"$f":"$V71*MULT_ANT+$U71*MULT_RPT+$T71*MULT_MRF+$S71*MULT_VRF","v":589},{"$f":"IF(LEFT($J71,4)=\"INVA\",$J$4,IF($A71=\"X\",$A$4,0)+IF($B71=\"X\",$B$4,0)+IF($D71=\"X\",$D$4,0)+IF($E71=\"X\",$E$4,0)+IF($F71=\"X\",$F$4,0)+IF($G71=\"X\",$G$4,0)+IF($I71=\"X\",$I$4,0)+IF($C71=\"X\",$C$4,0))","v":0},{"$f":"COUNTA(L71:M71)+IF(RIGHT(N71&O71,1)=\"X\",1,0)","v":1},"No Drawing",0,"Illogical terminology",{"$f":"IF(COUNTIF($A71:$H71, \"<>\"&\"\")=0,\"INVALID COMBO\",\"\")","v":"INVALID COMBO"},"INVALID COMBO"]
[null,null,null,null,null,null,null,null,null,"INVALID COMBO","UHF",null,"X",null,null,"ALL","XB-Only","SUITCASE-DVRS(UHF) Crossband/No Inband; For APX (UHF) using One All-Band Antenna",2,2,3,1,590,0,1,"No Drawing",0,"Illogical terminology","INVALID COMBO","INVALID COMBO"]
[null,null,null,null,null,null,null,null,null,"INVALID COMBO","UHF",null,"X",null,null,"USER","XB-Only","SUITCASE-DVRS(UHF) Crossband/No Inband; For APX (UHF) using Unknown or User-Defined Antenna",2,2,3,2,591,0,1,"No Drawing",0,null,"INVALID COMBO","INVALID COMBO"]
[null,null,null,null,null,null,"X",null,null,"INVALID COMBO","UHF","X","X",null,null,"USER","IB-Only","SUITCASE-DVRS(UHF) Inband/No Crossband; For APX (VHF+UHF) using Unknown or User-Defined Antenna",2,3,1,2,602,0,2,"No Drawing",6,null,""]
[null,"X",null,null,null,null,null,null,"X","INVALID COMBO","UHF","X","X",null,null,"SINGLE","XB-Only","SUITCASE-DVRS(UHF) Crossband/No Inband; For APX (VHF+UHF) using Single-Band Antenna(s)",2,3,3,0,606,0,2,"No Drawing",18,"Original Special Order","","Special Order"]
[null,null,null,"X",null,null,null,null,null,"INVALID COMBO","UHF","X","X",null,null,"ALL","XB-Only","SUITCASE-DVRS(UHF) Crossband/No Inband; For APX (VHF+UHF) using One All-Band Antenna",2,3,3,1,607,0,2,"No Drawing",18,"Original Special Order","","Special Order"]
[null,null,null,"X",null,null,null,null,null,"INVALID COMBO","UHF","X","X",null,null,"USER","XB-Only","SUITCASE-DVRS(UHF) Crossband/No Inband; For APX (VHF+UHF) using Unknown or User-Defined Antenna",2,3,3,2,608,0,2,"No Drawing",18,null,"","Special Order"]
[null,null,null,null,"X",null,"X",null,null,"INVALID COMBO","UHF","X","X",null,null,"USER","IB+XB","SUITCASE-DVRS(UHF) Inband & Crossband; For APX (VHF+UHF) using Unknown or User-Defined Antenna",2,3,5,2,614,0,2,"No Drawing",10,null,""]
[null,"X",null,null,null,null,null,null,null,"","UHF",null,null,"X",null,"SINGLE","XB-Forced","SUITCASE-DVRS(UHF) Crossband; For APX (700) using Single-Band Antenna(s)",2,4,4,0,626,19,1,"No Drawing",2,"Single MSU Band",""]
[null,"X",null,null,null,null,null,null,null,"","UHF",null,null,"X",null,"ALL","XB-Forced","SUITCASE-DVRS(UHF) Crossband; For APX (700) using One All-Band Antenna",2,4,4,1,627,19,1,"No Drawing",2,"Single MSU Band",""]
[null,"X",null,null,null,null,null,null,null,"INVALID COMBO","UHF",null,null,"X",null,"USER","XB-Forced","SUITCASE-DVRS(UHF) Crossband; For APX (700) using Unknown or User-Defined Antenna",2,4,4,2,628,0,1,"No Drawing",2,null,""]
[null,null,null,null,"X",null,null,null,null,"INVALID COMBO","UHF","X",null,"X",null,"USER","XB-Forced","SUITCASE-DVRS(UHF) Crossband; For APX (VHF+700) using Unknown or User-Defined Antenna",2,5,4,2,645,0,2,"No Drawing",4,null,""]
[null,null,null,null,null,null,"X",null,null,"INVALID COMBO","UHF",null,"X","X",null,"USER","IB-Only","SUITCASE-DVRS(UHF) Inband/No Crossband; For APX (UHF+700) using Unknown or User-Defined Antenna",2,6,1,2,653,0,2,"No Drawing",6,null,""]
[null,"X",null,null,null,null,null,null,"X","INVALID COMBO","UHF",null,"X","X",null,"SINGLE","XB-Only","SUITCASE-DVRS(UHF) Crossband/No Inband; For APX (UHF+700) using Single-Band Antenna(s)",2,6,3,0,657,0,2,"No Drawing",18,"Original Special Order","","Special Order"]
[null,null,null,"X",null,null,null,null,null,"INVALID COMBO","UHF",null,"X","X",null,"ALL","XB-Only","SUITCASE-DVRS(UHF) Crossband/No Inband; For APX (UHF+700) using One All-Band Antenna",2,6,3,1,658,0,2,"No Drawing",18,"Original Special Order","","Special Order"]
[null,null,null,"X",null,null,null,null,null,"INVALID COMBO","UHF",null,"X","X",null,"USER","XB-Only","SUITCASE-DVRS(UHF) Crossband/No Inband; For APX (UHF+700) using Unknown or User-Defined Antenna",2,6,3,2,659,0,2,"No Drawing",18,null,"","Special Order"]
[null,null,null,null,"X",null,"X",null,null,"INVALID COMBO","UHF",null,"X","X",null,"USER","IB+XB","SUITCASE-DVRS(UHF) Inband & Crossband; For APX (UHF+700) using Unknown or User-Defined Antenna",2,6,5,2,665,0,2,"No Drawing",10,null,""]
[null,null,null,null,null,null,null,null,null,"INVALID COMBO","UHF","X","X","X",null,"SINGLE","IB-Only","SUITCASE-DVRS(UHF) Inband/No Crossband; For APX (VHF+UHF+700) using Single-Band Antenna(s)",2,7,1,0,668,0,3,"No Drawing",8,"3-Band Single Antenna","INVALID COMBO"]
[null,null,null,null,null,null,"X",null,null,"INVALID COMBO","UHF","X","X","X",null,"USER","IB-Only","SUITCASE-DVRS(UHF) Inband/No Crossband; For APX (VHF+UHF+700) using Unknown or User-Defined Antenna",2,7,1,2,670,0,3,"No Drawing",6,null,""]
[null,null,null,null,null,null,null,null,null,"INVALID COMBO","UHF","X","X","X",null,"SINGLE","XB-Only","SUITCASE-DVRS(UHF) Crossband/No Inband; For APX (VHF+UHF+700) using Single-Band Antenna(s)",2,7,3,0,674,0,3,"No Drawing",18,"3-Band Single Antenna","INVALID COMBO","Special Order"]
[null,null,null,null,null,"X",null,null,null,"INVALID COMBO","UHF","X","X","X",null,"ALL","XB-Only","SUITCASE-DVRS(UHF) Crossband/No Inband; For APX (VHF+UHF+700) using One All-Band Antenna",2,7,3,1,675,0,3,"No Drawing",18,"Original Special Order","","Special Order"]
[null,null,null,null,null,"X",null,null,null,"INVALID COMBO","UHF","X","X","X",null,"USER","XB-Only","SUITCASE-DVRS(UHF) Crossband/No Inband; For APX (VHF+UHF+700) using Unknown or User-Defined Antenna",2,7,3,2,676,0,3,"No Drawing",18,null,"","Special Order"]
[null,null,null,null,null,null,null,null,null,"INVALID COMBO","UHF","X","X","X",null,"SINGLE","IB+XB","SUITCASE-DVRS(UHF) Inband & Crossband; For APX (VHF+UHF+700) using Single-Band Antenna(s)",2,7,5,0,680,0,3,"No Drawing",8,"3-Band Single Antenna","INVALID COMBO"]
[null,null,null,null,"X",null,"X",null,null,"INVALID COMBO","UHF","X","X","X",null,"USER","IB+XB","SUITCASE-DVRS(UHF) Inband & Crossband; For APX (VHF+UHF+700) using Unknown or User-Defined Antenna",2,7,5,2,682,0,3,"No Drawing",10,null,""]
[null,"X",null,null,null,null,null,null,null,"","UHF",null,null,null,"X","SINGLE","XB-Forced","SUITCASE-DVRS(UHF) Crossband; For APX (800) using Single-Band Antenna(s)",2,8,4,0,694,19,1,"No Drawing",2,"Single MSU Band",""]
[null,"X",null,null,null,null,null,null,null,"","UHF",null,null,null,"X","ALL","XB-Forced","SUITCASE-DVRS(UHF) Crossband; For APX (800) using One All-Band Antenna",2,8,4,1,695,19,1,"No Drawing",2,"Single MSU Band",""]
[null,"X",null,null,null,null,null,null,null,"INVALID COMBO","UHF",null,null,null,"X","USER","XB-Forced","SUITCASE-DVRS(UHF) Crossband; For APX (800) using Unknown or User-Defined Antenna",2,8,4,2,696,0,1,"No Drawing",2,null,""]
[null,null,null,null,"X",null,null,null,null,"INVALID COMBO","UHF","X",null,null,"X","USER","XB-Forced","SUITCASE-DVRS(UHF) Crossband; For APX (VHF+800) using Unknown or User-Defined Antenna",2,9,4,2,713,0,2,"No Drawing",4,null,""]
[null,null,null,null,null,null,"X",null,null,"INVALID COMBO","UHF",null,"X",null,"X","USER","IB-Only","SUITCASE-DVRS(UHF) Inband/No Crossband; For APX (UHF+800) using Unknown or User-Defined Antenna",2,10,1,2,721,0,2,"No Drawing",6,null,""]
[null,"X",null,null,null,null,null,null,"X","INVALID COMBO","UHF",null,"X",null,"X","SINGLE","XB-Only","SUITCASE-DVRS(UHF) Crossband/No Inband; For APX (UHF+800) using Single-Band Antenna(s)",2,10,3,0,725,0,2,"No Drawing",18,"Original Special Order","","Special Order"]
[null,null,null,"X",null,null,null,null,null,"INVALID COMBO","UHF",null,"X",null,"X","ALL","XB-Only","SUITCASE-DVRS(UHF) Crossband/No Inband; For APX (UHF+800) using One All-Band Antenna",2,10,3,1,726,0,2,"No Drawing",18,"Original Special Order","","Special Order"]
[null,null,null,"X",null,null,null,null,null,"INVALID COMBO","UHF",null,"X",null,"X","USER","XB-Only","SUITCASE-DVRS(UHF) Crossband/No Inband; For APX (UHF+800) using Unknown or User-Defined Antenna",2,10,3,2,727,0,2,"No Drawing",18,null,"","Special Order"]
[null,null,null,null,"X",null,"X",null,null,"INVALID COMBO","UHF",null,"X",null,"X","USER","IB+XB","SUITCASE-DVRS(UHF) Inband & Crossband; For APX (UHF+800) using Unknown or User-Defined Antenna",2,10,5,2,733,0,2,"No Drawing",10,null,""]
[null,null,null,null,null,null,null,null,null,"INVALID COMBO","UHF","X","X",null,"X","SINGLE","IB-Only","SUITCASE-DVRS(UHF) Inband/No Crossband; For APX (VHF+UHF+800) using Single-Band Antenna(s)",2,11,1,0,736,0,3,"No Drawing",8,"3-Band Single Antenna","INVALID COMBO"]
[null,null,null,null,null,null,"X",null,null,"INVALID COMBO","UHF","X","X",null,"X","USER","IB-Only","SUITCASE-DVRS(UHF) Inband/No Crossband; For APX (VHF+UHF+800) using Unknown or User-Defined Antenna",2,11,1,2,738,0,3,"No Drawing",6,null,""]
[null,null,null,null,null,null,null,null,null,"INVALID COMBO","UHF","X","X",null,"X","SINGLE","XB-Only","SUITCASE-DVRS(UHF) Crossband/No Inband; For APX (VHF+UHF+800) using Single-Band Antenna(s)",2,11,3,0,742,0,3,"No Drawing",18,"3-Band Single Antenna","INVALID COMBO","Special Order"]
[null,null,null,null,null,"X",null,null,null,"INVALID COMBO","UHF","X","X",null,"X","ALL","XB-Only","SUITCASE-DVRS(UHF) Crossband/No Inband; For APX (VHF+UHF+800) using One All-Band Antenna",2,11,3,1,743,0,3,"No Drawing",18,"Original Special Order","","Special Order"]
[null,null,null,null,null,"X",null,null,null,"INVALID COMBO","UHF","X","X",null,"X","USER","XB-Only","SUITCASE-DVRS(UHF) Crossband/No Inband; For APX (VHF+UHF+800) using Unknown or User-Defined Antenna",2,11,3,2,744,0,3,"No Drawing",18,null,"","Special Order"]
[null,null,null,null,null,null,null,null,null,"INVALID COMBO","UHF","X","X",null,"X","SINGLE","IB+XB","SUITCASE-DVRS(UHF) Inband & Crossband; For APX (VHF+UHF+800) using Single-Band Antenna(s)",2,11,5,0,748,0,3,"No Drawing",8,"3-Band Single Antenna","INVALID COMBO"]
[null,null,null,null,"X",null,"X",null,null,"INVALID COMBO","UHF","X","X",null,"X","USER","IB+XB","SUITCASE-DVRS(UHF) Inband & Crossband; For APX (VHF+UHF+800) using Unknown or User-Defined Antenna",2,11,5,2,750,0,3,"No Drawing",10,null,""]
[null,"X",null,null,null,null,null,null,null,"","UHF",null,null,"X","X","SINGLE","XB-Forced","SUITCASE-DVRS(UHF) Crossband; For APX (700+800) using Single-Band Antenna(s)",2,12,4,0,762,19,1,"No Drawing",2,"Single MSU Band",""]
[null,"X",null,null,null,null,null,null,null,"","UHF",null,null,"X","X","ALL","XB-Forced","SUITCASE-DVRS(UHF) Crossband; For APX (700+800) using One All-Band Antenna",2,12,4,1,763,19,1,"No Drawing",2,"Single MSU Band",""]
[null,"X",null,null,null,null,null,null,null,"INVALID COMBO","UHF",null,null,"X","X","USER","XB-Forced","SUITCASE-DVRS(UHF) Crossband; For APX (700+800) using Unknown or User-Defined Antenna",2,12,4,2,764,0,1,"No Drawing",2,null,""]
[null,null,null,null,"X",null,null,null,null,"INVALID COMBO","UHF","X",null,"X","X","USER","XB-Forced","SUITCASE-DVRS(UHF) Crossband; For APX (VHF+700+800) using Unknown or User-Defined Antenna",2,13,4,2,781,0,2,"No Drawing",4,null,""]
[null,null,null,null,null,null,"X",null,null,"INVALID COMBO","UHF",null,"X","X","X","USER","IB-Only","SUITCASE-DVRS(UHF) Inband/No Crossband; For APX (UHF+700+800) using Unknown or User-Defined Antenna",2,14,1,2,789,0,2,"No Drawing",6,null,""]
[null,"X",null,null,null,null,null,null,"X","INVALID COMBO","UHF",null,"X","X","X","SINGLE","XB-Only","SUITCASE-DVRS(UHF) Crossband/No Inband; For APX (UHF+700+800) using Single-Band Antenna(s)",2,14,3,0,793,0,2,"No Drawing",18,"Original Special Order","","Special Order"]
[null,null,null,"X",null,null,null,null,null,"INVALID COMBO","UHF",null,"X","X","X","ALL","XB-Only","SUITCASE-DVRS(UHF) Crossband/No Inband; For APX (UHF+700+800) using One All-Band Antenna",2,14,3,1,794,0,2,"No Drawing",18,"Original Special Order","","Special Order"]
[null,null,null,"X",null,null,null,null,null,"INVALID COMBO","UHF",null,"X","X","X","USER","XB-Only","SUITCASE-DVRS(UHF) Crossband/No Inband; For APX (UHF+700+800) using Unknown or User-Defined Antenna",2,14,3,2,795,0,2,"No Drawing",18,null,"","Special Order"]
[null,null,null,null,"X",null,"X",null,null,"INVALID COMBO","UHF",null,"X","X","X","USER","IB+XB","SUITCASE-DVRS(UHF) Inband & Crossband; For APX (UHF+700+800) using Unknown or User-Defined Antenna",2,14,5,2,801,0,2,"No Drawing",10,null,""]
[null,null,null,null,null,null,null,null,null,"INVALID COMBO","UHF","X","X","X","X","SINGLE","IB-Only","SUITCASE-DVRS(UHF) Inband/No Crossband; For APX (VHF+UHF+700+800) using Single-Band Antenna(s)",2,15,1,0,804,0,3,"No Drawing",8,"3-Band Single Antenna","INVALID COMBO"]
[null,null,null,null,null,null,"X",null,null,"INVALID COMBO","UHF","X","X","X","X","USER","IB-Only","SUITCASE-DVRS(UHF) Inband/No Crossband; For APX (VHF+UHF+700+800) using Unknown or User-Defined Antenna",2,15,1,2,806,0,3,"No Drawing",6,null,""]
[null,null,null,null,null,null,null,null,null,"INVALID COMBO","UHF","X","X","X","X","SINGLE","XB-Only","SUITCASE-DVRS(UHF) Crossband/No Inband; For APX (VHF+UHF+700+800) using Single-Band Antenna(s)",2,15,3,0,810,0,3,"No Drawing",18,"3-Band Single Antenna","INVALID COMBO","Special Order"]
[null,null,null,null,null,"X",null,null,null,"INVALID COMBO","UHF","X","X","X","X","ALL","XB-Only","SUITCASE-DVRS(UHF) Crossband/No Inband; For APX (VHF+UHF+700+800) using One All-Band Antenna",2,15,3,1,811,0,3,"No Drawing",18,"Original Special Order","","Special Order"]
[null,null,null,null,null,"X",null,null,null,"INVALID COMBO","UHF","X","X","X","X","USER","XB-Only","SUITCASE-DVRS(UHF) Crossband/No Inband; For APX (VHF+UHF+700+800) using Unknown or User-Defined Antenna",2,15,3,2,812,0,3,"No Drawing",18,null,"","Special Order"]
[null,null,null,null,null,null,null,null,null,"INVALID COMBO","UHF","X","X","X","X","SINGLE","IB+XB","SUITCASE-DVRS(UHF) Inband & Crossband; For APX (VHF+UHF+700+800) using Single-Band Antenna(s)",2,15,5,0,816,0,3,"No Drawing",8,"3-Band Single Antenna","INVALID COMBO"]
[null,null,null,null,"X",null,"X",null,null,"INVALID COMBO","UHF","X","X","X","X","USER","IB+XB","SUITCASE-DVRS(UHF) Inband & Crossband; For APX (VHF+UHF+700+800) using Unknown or User-Defined Antenna",2,15,5,2,818,0,3,"No Drawing",10,null,""]
[null,"X",null,null,null,null,null,null,null,"",700,"X",null,null,null,"SINGLE","XB-Forced","SUITCASE-DVRS(700) Crossband; For APX (VHF) using Single-Band Antenna(s)",3,1,4,0,848,19,1,"No Drawing",2,"Single MSU Band",""]
[null,"X",null,null,null,null,null,null,null,"",700,"X",null,null,null,"ALL","XB-Forced","SUITCASE-DVRS(700) Crossband; For APX (VHF) using One All-Band Antenna",3,1,4,1,849,19,1,"No Drawing",2,"Single MSU Band",""]
[null,"X",null,null,null,null,null,null,null,"INVALID COMBO",700,"X",null,null,null,"USER","XB-Forced","SUITCASE-DVRS(700) Crossband; For APX (VHF) using Unknown or User-Defined Antenna",3,1,4,2,850,0,1,"No Drawing",2,"Single MSU Band",""]
[null,"X",null,null,null,null,null,null,null,"",700,null,"X",null,null,"SINGLE","XB-Forced","SUITCASE-DVRS(700) Crossband; For APX (UHF) using Single-Band Antenna(s)",3,2,4,0,865,19,1,"No Drawing",2,"Single MSU Band",""]
[null,"X",null,null,null,null,null,null,null,"",700,null,"X",null,null,"ALL","XB-Forced","SUITCASE-DVRS(700) Crossband; For APX (UHF) using One All-Band Antenna",3,2,4,1,866,19,1,"No Drawing",2,"Single MSU Band",""]
[null,"X",null,null,null,null,null,null,null,"INVALID COMBO",700,null,"X",null,null,"USER","XB-Forced","SUITCASE-DVRS(700) Crossband; For APX (UHF) using Unknown or User-Defined Antenna",3,2,4,2,867,0,1,"No Drawing",2,null,""]
[null,null,null,null,"X",null,null,null,null,"INVALID COMBO",700,"X","X",null,null,"USER","XB-Forced","SUITCASE-DVRS(700) Crossband; For APX (VHF+UHF) using Unknown or User-Defined Antenna",3,3,4,2,884,0,2,"No Drawing",4,null,""]
["X",null,null,null,null,null,"X",null,null,"INVALID COMBO",700,null,null,"X",null,"USER","IB-Forced","SUITCASE-DVRS(700) Inband; For APX (700) using Unknown or User-Defined Antenna",3,4,2,2,895,0,1,"No Drawing",7,null,""]
[null,null,null,null,null,null,null,null,null,{"$f":"IF(OR(AND(Y135>2,$P135<>\"All\"),$P135=\"USER\",$Q135=\"XB-Only\"),\"INVALID COMBO\",\"\")","v":"INVALID COMBO"},700,null,null,"X",null,"SINGLE","XB-Only",{"$f":"$K$6&\"(\"&$K135&\")\"&\" \"&VLOOKUP($Q135,RPTCodes,2,FALSE) &\"; For APX (\"&VLOOKUP($T135,BAND_NAMES,2)&\") using \"&VLOOKUP($P135,ANTcodes,3,FALSE)","v":"SUITCASE-DVRS(700) Crossband/No Inband; For APX (700) using Single-Band Antenna(s)"},{"$f":"VLOOKUP(K135,Freq_Bands,2)","v":3},{"$f":"IF(L135=\"X\",1,0)+IF(M135=\"X\",2,0)+IF(N135=\"X\",4,0)+IF(O135=\"X\",8,0)","v":4},{"$f":"VLOOKUP(Q135,RPTCodes,4,FALSE)","v":3},{"$f":"VLOOKUP(P135,ANTcodes,2,FALSE)","v":0},{"$f":"$V135*MULT_ANT+$U135*MULT_RPT+$T135*MULT_MRF+$S135*MULT_VRF","v":896},{"$f":"IF(LEFT($J135,4)=\"INVA\",$J$4,IF($A135=\"X\",$A$4,0)+IF($B135=\"X\",$B$4,0)+IF($D135=\"X\",$D$4,0)+IF($E135=\"X\",$E$4,0)+IF($F135=\"X\",$F$4,0)+IF($G135=\"X\",$G$4,0)+IF($I135=\"X\",$I$4,0)+IF($C135=\"X\",$C$4,0))","v":0},{"$f":"COUNTA(L135:M135)+IF(RIGHT(N135&O135,1)=\"X\",1,0)","v":1},"No Drawing",0,"Illogical terminology",{"$f":"IF(COUNTIF($A135:$H135, \"<>\"&\"\")=0,\"INVALID COMBO\",\"\")","v":"INVALID COMBO"},"INVALID COMBO"]
[null,null,null,null,null,null,null,null,null,"INVALID COMBO",700,null,null,"X",null,"ALL","XB-Only","SUITCASE-DVRS(700) Crossband/No Inband; For APX (700) using One All-Band Antenna",3,4,3,1,897,0,1,"No Drawing",0,"Illogical terminology","INVALID COMBO","INVALID COMBO"]
[" ",null,null,null,null,null,null,null,null,"INVALID COMBO",700,null,null,"X",null,"USER","XB-Only","SUITCASE-DVRS(700) Crossband/No Inband; For APX (700) using Unknown or User-Defined Antenna",3,4,3,2,898,0,1,"No Drawing",0,null,"","INVALID COMBO"]
[null,null,null,null,null,null,"X",null,null,"INVALID COMBO",700,"X",null,"X",null,"USER","IB-Only","SUITCASE-DVRS(700) Inband/No Crossband; For APX (VHF+700) using Unknown or User-Defined Antenna",3,5,1,2,909,0,2,"No Drawing",6,null,""]
[null,"X",null,null,null,null,null,null,"X","INVALID COMBO",700,"X",null,"X",null,"SINGLE","XB-Only","SUITCASE-DVRS(700) Crossband/No Inband; For APX (VHF+700) using Single-Band Antenna(s)",3,5,3,0,913,0,2,"No Drawing",18,"Original Special Order","","Special Order"]
[null,null,null,"X",null,null,null,null,null,"INVALID COMBO",700,"X",null,"X",null,"ALL","XB-Only","SUITCASE-DVRS(700) Crossband/No Inband; For APX (VHF+700) using One All-Band Antenna",3,5,3,1,914,0,2,"No Drawing",18,"Original Special Order","","Special Order"]
[null,null,null,"X",null,null,null,null,null,"INVALID COMBO",700,"X",null,"X",null,"USER","XB-Only","SUITCASE-DVRS(700) Crossband/No Inband; For APX (VHF+700) using Unknown or User-Defined Antenna",3,5,3,2,915,0,2,"No Drawing",18,null,"","Special Order"]
[null,null,null,null,"X",null,"X",null,null,"INVALID COMBO",700,"X",null,"X",null,"USER","IB+XB","SUITCASE-DVRS(700) Inband & Crossband; For APX (VHF+700) using Unknown or User-Defined Antenna",3,5,5,2,921,0,2,"No Drawing",10,null,""]
[null,null,null,null,null,null,"X",null,null,"INVALID COMBO",700,null,"X","X",null,"USER","IB-Only","SUITCASE-DVRS(700) Inband/No Crossband; For APX (UHF+700) using Unknown or User-Defined Antenna",3,6,1,2,926,0,2,"No Drawing",6,null,""]
[null,"X",null,null,null,null,null,null,"X","INVALID COMBO",700,null,"X","X",null,"SINGLE","XB-Only","SUITCASE-DVRS(700) Crossband/No Inband; For APX (UHF+700) using Single-Band Antenna(s)",3,6,3,0,930,0,2,"No Drawing",18,"Original Special Order","","Special Order"]
[null,null,null,"X",null,null,null,null,null,"INVALID COMBO",700,null,"X","X",null,"ALL","XB-Only","SUITCASE-DVRS(700) Crossband/No Inband; For APX (UHF+700) using One All-Band Antenna",3,6,3,1,931,0,2,"No Drawing",18,"Original Special Order","","Special Order"]
[null,null,null,"X",null,null,null,null,null,"INVALID COMBO",700,null,"X","X",null,"USER","XB-Only","SUITCASE-DVRS(700) Crossband/No Inband; For APX (UHF+700) using Unknown or User-Defined Antenna",3,6,3,2,932,0,2,"No Drawing",18,null,"","Special Order"]
[null,null,null,null,"X",null,"X",null,null,"INVALID COMBO",700,null,"X","X",null,"USER","IB+XB","SUITCASE-DVRS(700) Inband & Crossband; For APX (UHF+700) using Unknown or User-Defined Antenna",3,6,5,2,938,0,2,"No Drawing",10,null,""]
[null,null,null,null,null,null,null,null,null,"INVALID COMBO",700,"X","X","X",null,"SINGLE","IB-Only","SUITCASE-DVRS(700) Inband/No Crossband; For APX (VHF+UHF+700) using Single-Band Antenna(s)",3,7,1,0,941,0,3,"No Drawing",8,"3-Band Single Antenna","INVALID COMBO"]
[null,null,null,null,null,null,"X",null,null,"INVALID COMBO",700,"X","X","X",null,"USER","IB-Only","SUITCASE-DVRS(700) Inband/No Crossband; For APX (VHF+UHF+700) using Unknown or User-Defined Antenna",3,7,1,2,943,0,3,"No Drawing",6,null,""]
[null,null,null,null,null,null,null,null,null,"INVALID COMBO",700,"X","X","X",null,"SINGLE","XB-Only","SUITCASE-DVRS(700) Crossband/No Inband; For APX (VHF+UHF+700) using Single-Band Antenna(s)",3,7,3,0,947,0,3,"No Drawing",18,"3-Band Single Antenna","INVALID COMBO","Special Order"]
[null,null,null,null,null,"X",null,null,null,"INVALID COMBO",700,"X","X","X",null,"ALL","XB-Only","SUITCASE-DVRS(700) Crossband/No Inband; For APX (VHF+UHF+700) using One All-Band Antenna",3,7,3,1,948,0,3,"No Drawing",18,"Original Special Order","","Special Order"]
[null,null,null,null,null,"X",null,null,null,"INVALID COMBO",700,"X","X","X",null,"USER","XB-Only","SUITCASE-DVRS(700) Crossband/No Inband; For APX (VHF+UHF+700) using Unknown or User-Defined Antenna",3,7,3,2,949,0,3,"No Drawing",18,null,"","Special Order"]
[null,null,null,null,null,null,null,null,null,"INVALID COMBO",700,"X","X","X",null,"SINGLE","IB+XB","SUITCASE-DVRS(700) Inband & Crossband; For APX (VHF+UHF+700) using Single-Band Antenna(s)",3,7,5,0,953,0,3,"No Drawing",8,"3-Band Single Antenna","INVALID COMBO"]
[null,null,null,null,"X",null,"X",null,null,"INVALID COMBO",700,"X","X","X",null,"USER","IB+XB","SUITCASE-DVRS(700) Inband & Crossband; For APX (VHF+UHF+700) using Unknown or User-Defined Antenna",3,7,5,2,955,0,3,"No Drawing",10,null,""]
["X",null,null,null,null,null,"X",null,null,"INVALID COMBO",700,null,null,null,"X","USER","IB-Forced","SUITCASE-DVRS(700) Inband; For APX (800) using Unknown or User-Defined Antenna",3,8,2,2,963,0,1,"No Drawing",7,null,""]
[null,null,null,null,null,null,null,null,null,"INVALID COMBO",700,null,null,null,"X","SINGLE","XB-Only","SUITCASE-DVRS(700) Crossband/No Inband; For APX (800) using Single-Band Antenna(s)",3,8,3,0,964,0,1,"No Drawing",0,"Illogical terminology","INVALID COMBO","INVALID COMBO"]
[null,null,null,null,null,null,null,null,null,"INVALID COMBO",700,null,null,null,"X","ALL","XB-Only","SUITCASE-DVRS(700) Crossband/No Inband; For APX (800) using One All-Band Antenna",3,8,3,1,965,0,1,"No Drawing",0,"Illogical terminology","INVALID COMBO","INVALID COMBO"]
[null,null,null,null,null,null,null,null,null,"INVALID COMBO",700,null,null,null,"X","USER","XB-Only","SUITCASE-DVRS(700) Crossband/No Inband; For APX (800) using Unknown or User-Defined Antenna",3,8,3,2,966,0,1,"No Drawing",0,null,"INVALID COMBO","INVALID COMBO"]
[null,null,null,null,null,null,"X",null,null,"INVALID COMBO",700,"X",null,null,"X","USER","IB-Only","SUITCASE-DVRS(700) Inband/No Crossband; For APX (VHF+800) using Unknown or User-Defined Antenna",3,9,1,2,977,0,2,"No Drawing",6,null,""]
[null,"X",null,null,null,null,null,null,"X","INVALID COMBO",700,"X",null,null,"X","SINGLE","XB-Only","SUITCASE-DVRS(700) Crossband/No Inband; For APX (VHF+800) using Single-Band Antenna(s)",3,9,3,0,981,0,2,"No Drawing",18,"Original Special Order","","Special Order"]
[null,null,null,"X",null,null,null,null,null,"INVALID COMBO",700,"X",null,null,"X","ALL","XB-Only","SUITCASE-DVRS(700) Crossband/No Inband; For APX (VHF+800) using One All-Band Antenna",3,9,3,1,982,0,2,"No Drawing",18,"Original Special Order","","Special Order"]
[null,null,null,"X",null,null,null,null,null,"INVALID COMBO",700,"X",null,null,"X","USER","XB-Only","SUITCASE-DVRS(700) Crossband/No Inband; For APX (VHF+800) using Unknown or User-Defined Antenna",3,9,3,2,983,0,2,"No Drawing",18,null,"","Special Order"]
[null,null,null,null,"X",null,"X",null,null,"INVALID COMBO",700,"X",null,null,"X","USER","IB+XB","SUITCASE-DVRS(700) Inband & Crossband; For APX (VHF+800) using Unknown or User-Defined Antenna",3,9,5,2,989,0,2,"No Drawing",10,null,""]
[null,null,null,null,null,null,"X",null,null,"INVALID COMBO",700,null,"X",null,"X","USER","IB-Only","SUITCASE-DVRS(700) Inband/No Crossband; For APX (UHF+800) using Unknown or User-Defined Antenna",3,10,1,2,994,0,2,"No Drawing",6,null,""]
[null,"X",null,null,null,null,null,null,"X","INVALID COMBO",700,null,"X",null,"X","SINGLE","XB-Only","SUITCASE-DVRS(700) Crossband/No Inband; For APX (UHF+800) using Single-Band Antenna(s)",3,10,3,0,998,0,2,"No Drawing",18,"Original Special Order","","Special Order"]
[null,null,null,"X",null,null,null,null,null,"INVALID COMBO",700,null,"X",null,"X","ALL","XB-Only","SUITCASE-DVRS(700) Crossband/No Inband; For APX (UHF+800) using One All-Band Antenna",3,10,3,1,999,0,2,"No Drawing",18,"Original Special Order","","Special Order"]
[null,null,null,"X",null,null,null,null,null,"INVALID COMBO",700,null,"X",null,"X","USER","XB-Only","SUITCASE-DVRS(700) Crossband/No Inband; For APX (UHF+800) using Unknown or User-Defined Antenna",3,10,3,2,1000,0,2,"No Drawing",18,null,"","Special Order"]
[null,null,null,null,"X",null,"X",null,null,"INVALID COMBO",700,null,"X",null,"X","USER","IB+XB","SUITCASE-DVRS(700) Inband & Crossband; For APX (UHF+800) using Unknown or User-Defined Antenna",3,10,5,2,1006,0,2,"No Drawing",10,null,""]
[null,null,null,null,null,null,null,null,null,"INVALID COMBO",700,"X","X",null,"X","SINGLE","IB-Only","SUITCASE-DVRS(700) Inband/No Crossband; For APX (VHF+UHF+800) using Single-Band Antenna(s)",3,11,1,0,1009,0,3,"No Drawing",8,"3-Band Single Antenna","INVALID COMBO"]
[null,null,null,null,null,null,"X",null,null,"INVALID COMBO",700,"X","X",null,"X","USER","IB-Only","SUITCASE-DVRS(700) Inband/No Crossband; For APX (VHF+UHF+800) using Unknown or User-Defined Antenna",3,11,1,2,1011,0,3,"No Drawing",6,null,""]
[null,null,null,null,null,null,null,null,null,"INVALID COMBO",700,"X","X",null,"X","SINGLE","XB-Only","SUITCASE-DVRS(700) Crossband/No Inband; For APX (VHF+UHF+800) using Single-Band Antenna(s)",3,11,3,0,1015,0,3,"No Drawing",18,"3-Band Single Antenna","INVALID COMBO","Special Order"]
[null,null,null,null,null,"X",null,null,null,"INVALID COMBO",700,"X","X",null,"X","ALL","XB-Only","SUITCASE-DVRS(700) Crossband/No Inband; For APX (VHF+UHF+800) using One All-Band Antenna",3,11,3,1,1016,0,3,"No Drawing",18,"Original Special Order","","Special Order"]
[null,null,null,null,null,"X",null,null,null,"INVALID COMBO",700,"X","X",null,"X","USER","XB-Only","SUITCASE-DVRS(700) Crossband/No Inband; For APX (VHF+UHF+800) using Unknown or User-Defined Antenna",3,11,3,2,1017,0,3,"No Drawing",18,null,"","Special Order"]
[null,null,null,null,null,null,null,null,null,"INVALID COMBO",700,"X","X",null,"X","SINGLE","IB+XB","SUITCASE-DVRS(700) Inband & Crossband; For APX (VHF+UHF+800) using Single-Band Antenna(s)",3,11,5,0,1021,0,3,"No Drawing",8,"3-Band Single Antenna","INVALID COMBO"]
[null,null,null,null,"X",null,"X",null,null,"INVALID COMBO",700,"X","X",null,"X","USER","IB+XB","SUITCASE-DVRS(700) Inband & Crossband; For APX (VHF+UHF+800) using Unknown or User-Defined Antenna",3,11,5,2,1023,0,3,"No Drawing",10,null,""]
["X",null,null,null,null,null,"X",null,null,"INVALID COMBO",700,null,null,"X","X","USER","IB-Forced","SUITCASE-DVRS(700) Inband; For APX (700+800) using Unknown or User-Defined Antenna",3,12,2,2,1031,0,1,"No Drawing",7,null,""]
[null,null,null,null,null,null,null,null,null,"INVALID COMBO",700,null,null,"X","X","SINGLE","XB-Only","SUITCASE-DVRS(700) Crossband/No Inband; For APX (700+800) using Single-Band Antenna(s)",3,12,3,0,1032,0,1,"No Drawing",0,"Illogical terminology","INVALID COMBO","INVALID COMBO"]
[null,null,null,null,null,null,null,null,null,"INVALID COMBO",700,null,null,"X","X","ALL","XB-Only","SUITCASE-DVRS(700) Crossband/No Inband; For APX (700+800) using One All-Band Antenna",3,12,3,1,1033,0,1,"No Drawing",0,"Illogical terminology","INVALID COMBO","INVALID COMBO"]
[null,null,null,null,null,null,null,null,null,"INVALID COMBO",700,null,null,"X","X","USER","XB-Only","SUITCASE-DVRS(700) Crossband/No Inband; For APX (700+800) using Unknown or User-Defined Antenna",3,12,3,2,1034,0,1,"No Drawing",0,null,"INVALID COMBO","INVALID COMBO"]
[null,null,null,null,null,null,"X",null,null,"INVALID COMBO",700,"X",null,"X","X","USER","IB-Only","SUITCASE-DVRS(700) Inband/No Crossband; For APX (VHF+700+800) using Unknown or User-Defined Antenna",3,13,1,2,1045,0,2,"No Drawing",6,null,""]
[null,"X",null,null,null,null,null,null,"X","INVALID COMBO",700,"X",null,"X","X","SINGLE","XB-Only","SUITCASE-DVRS(700) Crossband/No Inband; For APX (VHF+700+800) using Single-Band Antenna(s)",3,13,3,0,1049,0,2,"No Drawing",18,"Original Special Order","","Special Order"]
[null,null,null,"X",null,null,null,null,null,"INVALID COMBO",700,"X",null,"X","X","ALL","XB-Only","SUITCASE-DVRS(700) Crossband/No Inband; For APX (VHF+700+800) using One All-Band Antenna",3,13,3,1,1050,0,2,"No Drawing",18,"Original Special Order","","Special Order"]
[null,null,null,"X",null,null,null,null,null,"INVALID COMBO",700,"X",null,"X","X","USER","XB-Only","SUITCASE-DVRS(700) Crossband/No Inband; For APX (VHF+700+800) using Unknown or User-Defined Antenna",3,13,3,2,1051,0,2,"No Drawing",18,null,"","Special Order"]
[null,null,null,null,"X",null,"X",null,null,"INVALID COMBO",700,"X",null,"X","X","USER","IB+XB","SUITCASE-DVRS(700) Inband & Crossband; For APX (VHF+700+800) using Unknown or User-Defined Antenna",3,13,5,2,1057,0,2,"No Drawing",10,null,""]
[null,null,null,null,null,null,"X",null,null,"INVALID COMBO",700,null,"X","X","X","USER","IB-Only","SUITCASE-DVRS(700) Inband/No Crossband; For APX (UHF+700+800) using Unknown or User-Defined Antenna",3,14,1,2,1062,0,2,"No Drawing",6,null,""]
[null,"X",null,null,null,null,null,null,"X","INVALID COMBO",700,null,"X","X","X","SINGLE","XB-Only","SUITCASE-DVRS(700) Crossband/No Inband; For APX (UHF+700+800) using Single-Band Antenna(s)",3,14,3,0,1066,0,2,"No Drawing",18,"Original Special Order","","Special Order"]
[null,null,null,"X",null,null,null,null,null,"INVALID COMBO",700,null,"X","X","X","ALL","XB-Only","SUITCASE-DVRS(700) Crossband/No Inband; For APX (UHF+700+800) using One All-Band Antenna",3,14,3,1,1067,0,2,"No Drawing",18,"Original Special Order","","Special Order"]
[null,null,null,"X",null,null,null,null,null,"INVALID COMBO",700,null,"X","X","X","USER","XB-Only","SUITCASE-DVRS(700) Crossband/No Inband; For APX (UHF+700+800) using Unknown or User-Defined Antenna",3,14,3,2,1068,0,2,"No Drawing",18,null,"","Special Order"]
[null,null,null,null,"X",null,"X",null,null,"INVALID COMBO",700,null,"X","X","X","USER","IB+XB","SUITCASE-DVRS(700) Inband & Crossband; For APX (UHF+700+800) using Unknown or User-Defined Antenna",3,14,5,2,1074,0,2,"No Drawing",10,null,""]
[null,null,null,null,null,null,null,null,null,"INVALID COMBO",700,"X","X","X","X","SINGLE","IB-Only","SUITCASE-DVRS(700) Inband/No Crossband; For APX (VHF+UHF+700+800) using Single-Band Antenna(s)",3,15,1,0,1077,0,3,"No Drawing",8,"3-Band Single Antenna","INVALID COMBO"]
[null,null,null,null,null,null,"X",null,null,"INVALID COMBO",700,"X","X","X","X","USER","IB-Only","SUITCASE-DVRS(700) Inband/No Crossband; For APX (VHF+UHF+700+800) using Unknown or User-Defined Antenna",3,15,1,2,1079,0,3,"No Drawing",6,null,""]
[null,null,null,null,null,null,null,null,null,"INVALID COMBO",700,"X","X","X","X","SINGLE","XB-Only","SUITCASE-DVRS(700) Crossband/No Inband; For APX (VHF+UHF+700+800) using Single-Band Antenna(s)",3,15,3,0,1083,0,3,"No Drawing",18,"3-Band Single Antenna","INVALID COMBO","Special Order"]
[null,null,null,null,null,"X",null,null,null,"INVALID COMBO",700,"X","X","X","X","ALL","XB-Only","SUITCASE-DVRS(700) Crossband/No Inband; For APX (VHF+UHF+700+800) using One All-Band Antenna",3,15,3,1,1084,0,3,"No Drawing",18,"Original Special Order","","Special Order"]
[null,null,null,null,null,"X",null,null,null,"INVALID COMBO",700,"X","X","X","X","USER","XB-Only","SUITCASE-DVRS(700) Crossband/No Inband; For APX (VHF+UHF+700+800) using Unknown or User-Defined Antenna",3,15,3,2,1085,0,3,"No Drawing",18,null,"","Special Order"]
[null,null,null,null,null,null,null,null,null,"INVALID COMBO",700,"X","X","X","X","SINGLE","IB+XB","SUITCASE-DVRS(700) Inband & Crossband; For APX (VHF+UHF+700+800) using Single-Band Antenna(s)",3,15,5,0,1089,0,3,"No Drawing",8,"3-Band Single Antenna","INVALID COMBO"]
[null,null,null,null,"X",null,"X",null,null,"INVALID COMBO",700,"X","X","X","X","USER","IB+XB","SUITCASE-DVRS(700) Inband & Crossband; For APX (VHF+UHF+700+800) using Unknown or User-Defined Antenna",3,15,5,2,1091,0,3,"No Drawing",10,null,""]
[null,"X",null,null,null,null,null,null,null,"",800,"X",null,null,null,"SINGLE","XB-Forced","SUITCASE-DVRS(800) Crossband; For APX (VHF) using Single-Band Antenna(s)",4,1,4,0,1121,19,1,"No Drawing",2,"Single MSU Band",""]
[null,"X",null,null,null,null,null,null,null,"",800,"X",null,null,null,"ALL","XB-Forced","SUITCASE-DVRS(800) Crossband; For APX (VHF) using One All-Band Antenna",4,1,4,1,1122,19,1,"No Drawing",2,"Single MSU Band",""]
[null,"X",null,null,null,null,null,null,null,{"$f":"IF(OR(AND(Y199>2,$P199<>\"All\"),$P199=\"USER\",$Q199=\"XB-Only\"),\"INVALID COMBO\",\"\")","v":"INVALID COMBO"},800,"X",null,null,null,"USER","XB-Forced",{"$f":"$K$6&\"(\"&$K199&\")\"&\" \"&VLOOKUP($Q199,RPTCodes,2,FALSE) &\"; For APX (\"&VLOOKUP($T199,BAND_NAMES,2)&\") using \"&VLOOKUP($P199,ANTcodes,3,FALSE)","v":"SUITCASE-DVRS(800) Crossband; For APX (VHF) using Unknown or User-Defined Antenna"},{"$f":"VLOOKUP(K199,Freq_Bands,2)","v":4},{"$f":"IF(L199=\"X\",1,0)+IF(M199=\"X\",2,0)+IF(N199=\"X\",4,0)+IF(O199=\"X\",8,0)","v":1},{"$f":"VLOOKUP(Q199,RPTCodes,4,FALSE)","v":4},{"$f":"VLOOKUP(P199,ANTcodes,2,FALSE)","v":2},{"$f":"$V199*MULT_ANT+$U199*MULT_RPT+$T199*MULT_MRF+$S199*MULT_VRF","v":1123},{"$f":"IF(LEFT($J199,4)=\"INVA\",$J$4,IF($A199=\"X\",$A$4,0)+IF($B199=\"X\",$B$4,0)+IF($D199=\"X\",$D$4,0)+IF($E199=\"X\",$E$4,0)+IF($F199=\"X\",$F$4,0)+IF($G199=\"X\",$G$4,0)+IF($I199=\"X\",$I$4,0)+IF($C199=\"X\",$C$4,0))","v":0},{"$f":"COUNTA(L199:M199)+IF(RIGHT(N199&O199,1)=\"X\",1,0)","v":1},"No Drawing",2,"Single MSU Band",{"$f":"IF(COUNTIF($A199:$H199, \"<>\"&\"\")=0,\"INVALID COMBO\",\"\")","v":""}]
[null,"X",null,null,null,null,null,null,null,"",800,null,"X",null,null,"SINGLE","XB-Forced","SUITCASE-DVRS(800) Crossband; For APX (UHF) using Single-Band Antenna(s)",4,2,4,0,1138,19,1,"No Drawing",2,"Single MSU Band",""]
[null,"X",null,null,null,null,null,null,null,"",800,null,"X",null,null,"ALL","XB-Forced","SUITCASE-DVRS(800) Crossband; For APX (UHF) using One All-Band Antenna",4,2,4,1,1139,19,1,"No Drawing",2,"Single MSU Band",""]
[null,"X",null,null,null,null,null,null,null,"INVALID COMBO",800,null,"X",null,null,"USER","XB-Forced","SUITCASE-DVRS(800) Crossband; For APX (UHF) using Unknown or User-Defined Antenna",4,2,4,2,1140,0,1,"No Drawing",2,null,""]
[null,null,null,null,"X",null,null,null,null,"INVALID COMBO",800,"X","X",null,null,"USER","XB-Forced","SUITCASE-DVRS(800) Crossband; For APX (VHF+UHF) using Unknown or User-Defined Antenna",4,3,4,2,1157,0,2,"No Drawing",4,null,""]
["X",null,null,null,null,null,"X",null,null,"INVALID COMBO",800,null,null,"X",null,"USER","IB-Forced","SUITCASE-DVRS(800) Inband; For APX (700) using Unknown or User-Defined Antenna",4,4,2,2,1168,0,1,"No Drawing",7,null,""]
[null,null,null,null,null,null,null,null,null,"INVALID COMBO",800,null,null,"X",null,"SINGLE","XB-Only","SUITCASE-DVRS(800) Crossband/No Inband; For APX (700) using Single-Band Antenna(s)",4,4,3,0,1169,0,1,"No Drawing",0,"Illogical terminology","INVALID COMBO","INVALID COMBO"]
[null,null,null,null,null,null,null,null,null,"INVALID COMBO",800,null,null,"X",null,"ALL","XB-Only","SUITCASE-DVRS(800) Crossband/No Inband; For APX (700) using One All-Band Antenna",4,4,3,1,1170,0,1,"No Drawing",0,"Illogical terminology","INVALID COMBO","INVALID COMBO"]
[null,null,null,null,null,null,null,null,null,"INVALID COMBO",800,null,null,"X",null,"USER","XB-Only","SUITCASE-DVRS(800) Crossband/No Inband; For APX (700) using Unknown or User-Defined Antenna",4,4,3,2,1171,0,1,"No Drawing",0,null,"INVALID COMBO","INVALID COMBO"]
[null,null,null,null,null,null,"X",null,null,"INVALID COMBO",800,"X",null,"X",null,"USER","IB-Only","SUITCASE-DVRS(800) Inband/No Crossband; For APX (VHF+700) using Unknown or User-Defined Antenna",4,5,1,2,1182,0,2,"No Drawing",6,null,""]
[null,"X",null,null,null,null,null,null,"X","INVALID COMBO",800,"X",null,"X",null,"SINGLE","XB-Only","SUITCASE-DVRS(800) Crossband/No Inband; For APX (VHF+700) using Single-Band Antenna(s)",4,5,3,0,1186,0,2,"No Drawing",18,"Original Special Order","","Special Order"]
[null,null,null,"X",null,null,null,null,null,"INVALID COMBO",800,"X",null,"X",null,"ALL","XB-Only","SUITCASE-DVRS(800) Crossband/No Inband; For APX (VHF+700) using One All-Band Antenna",4,5,3,1,1187,0,2,"No Drawing",18,"Original Special Order","","Special Order"]
[null,null,null,"X",null,null,null,null,null,"INVALID COMBO",800,"X",null,"X",null,"USER","XB-Only","SUITCASE-DVRS(800) Crossband/No Inband; For APX (VHF+700) using Unknown or User-Defined Antenna",4,5,3,2,1188,0,2,"No Drawing",18,null,"","Special Order"]
[null,null,null,null,"X",null,"X",null,null,"INVALID COMBO",800,"X",null,"X",null,"USER","IB+XB","SUITCASE-DVRS(800) Inband & Crossband; For APX (VHF+700) using Unknown or User-Defined Antenna",4,5,5,2,1194,0,2,"No Drawing",10,null,""]
[null,null,null,null,null,null,"X",null,null,"INVALID COMBO",800,null,"X","X",null,"USER","IB-Only","SUITCASE-DVRS(800) Inband/No Crossband; For APX (UHF+700) using Unknown or User-Defined Antenna",4,6,1,2,1199,0,2,"No Drawing",6,null,""]
[null,"X",null,null,null,null,null,null,"X","INVALID COMBO",800,null,"X","X",null,"SINGLE","XB-Only","SUITCASE-DVRS(800) Crossband/No Inband; For APX (UHF+700) using Single-Band Antenna(s)",4,6,3,0,1203,0,2,"No Drawing",18,"Original Special Order","","Special Order"]
[null,null,null,"X",null,null,null,null,null,"INVALID COMBO",800,null,"X","X",null,"ALL","XB-Only","SUITCASE-DVRS(800) Crossband/No Inband; For APX (UHF+700) using One All-Band Antenna",4,6,3,1,1204,0,2,"No Drawing",18,"Original Special Order","","Special Order"]
[null,null,null,"X",null,null,null,null,null,"INVALID COMBO",800,null,"X","X",null,"USER","XB-Only","SUITCASE-DVRS(800) Crossband/No Inband; For APX (UHF+700) using Unknown or User-Defined Antenna",4,6,3,2,1205,0,2,"No Drawing",18,null,"","Special Order"]
[null,null,null,null,"X",null,"X",null,null,"INVALID COMBO",800,null,"X","X",null,"USER","IB+XB","SUITCASE-DVRS(800) Inband & Crossband; For APX (UHF+700) using Unknown or User-Defined Antenna",4,6,5,2,1211,0,2,"No Drawing",10,null,""]
[null,null,null,null,null,null,null,null,null,"INVALID COMBO",800,"X","X","X",null,"SINGLE","IB-Only","SUITCASE-DVRS(800) Inband/No Crossband; For APX (VHF+UHF+700) using Single-Band Antenna(s)",4,7,1,0,1214,0,3,"No Drawing",8,"3-Band Single Antenna","INVALID COMBO"]
[null,null,null,null,null,null,"X",null,null,"INVALID COMBO",800,"X","X","X",null,"USER","IB-Only","SUITCASE-DVRS(800) Inband/No Crossband; For APX (VHF+UHF+700) using Unknown or User-Defined Antenna",4,7,1,2,1216,0,3,"No Drawing",6,null,""]
[null,null,null,null,null,null,null,null,null,"INVALID COMBO",800,"X","X","X",null,"SINGLE","XB-Only","SUITCASE-DVRS(800) Crossband/No Inband; For APX (VHF+UHF+700) using Single-Band Antenna(s)",4,7,3,0,1220,0,3,"No Drawing",18,"3-Band Single Antenna","INVALID COMBO","Special Order"]
[null,null,null,null,null,"X",null,null,null,"INVALID COMBO",800,"X","X","X",null,"ALL","XB-Only","SUITCASE-DVRS(800) Crossband/No Inband; For APX (VHF+UHF+700) using One All-Band Antenna",4,7,3,1,1221,0,3,"No Drawing",18,"Original Special Order","","Special Order"]
[null,null,null,null,null,"X",null,null,null,"INVALID COMBO",800,"X","X","X",null,"USER","XB-Only","SUITCASE-DVRS(800) Crossband/No Inband; For APX (VHF+UHF+700) using Unknown or User-Defined Antenna",4,7,3,2,1222,0,3,"No Drawing",18,null,"","Special Order"]
[null,null,null,null,null,null,null,null,null,"INVALID COMBO",800,"X","X","X",null,"SINGLE","IB+XB","SUITCASE-DVRS(800) Inband & Crossband; For APX (VHF+UHF+700) using Single-Band Antenna(s)",4,7,5,0,1226,0,3,"No Drawing",8,"3-Band Single Antenna","INVALID COMBO"]
[null,null,null,null,"X",null,"X",null,null,"INVALID COMBO",800,"X","X","X",null,"USER","IB+XB","SUITCASE-DVRS(800) Inband & Crossband; For APX (VHF+UHF+700) using Unknown or User-Defined Antenna",4,7,5,2,1228,0,3,"No Drawing",10,null,""]
["X",null,null,null,null,null,"X",null,null,"INVALID COMBO",800,null,null,null,"X","USER","IB-Forced","SUITCASE-DVRS(800) Inband; For APX (800) using Unknown or User-Defined Antenna",4,8,2,2,1236,0,1,"No Drawing",7,null,""]
[null,null,null,null,null,null,null,null,null,"INVALID COMBO",800,null,null,null,"X","SINGLE","XB-Only","SUITCASE-DVRS(800) Crossband/No Inband; For APX (800) using Single-Band Antenna(s)",4,8,3,0,1237,0,1,"No Drawing",0,"Illogical terminology","INVALID COMBO","INVALID COMBO"]
[null,null,null,null,null,null,null,null,null,"INVALID COMBO",800,null,null,null,"X","ALL","XB-Only","SUITCASE-DVRS(800) Crossband/No Inband; For APX (800) using One All-Band Antenna",4,8,3,1,1238,0,1,"No Drawing",0,"Illogical terminology","INVALID COMBO","INVALID COMBO"]
[null,null,null,null,null,null,null,null,null,"INVALID COMBO",800,null,null,null,"X","USER","XB-Only","SUITCASE-DVRS(800) Crossband/No Inband; For APX (800) using Unknown or User-Defined Antenna",4,8,3,2,1239,0,1,"No Drawing",0,null,"INVALID COMBO","INVALID COMBO"]
[null,null,null,null,null,null,"X",null,null,"INVALID COMBO",800,"X",null,null,"X","USER","IB-Only","SUITCASE-DVRS(800) Inband/No Crossband; For APX (VHF+800) using Unknown or User-Defined Antenna",4,9,1,2,1250,0,2,"No Drawing",6,null,""]
[null,"X",null,null,null,null,null,null,"X","INVALID COMBO",800,"X",null,null,"X","SINGLE","XB-Only","SUITCASE-DVRS(800) Crossband/No Inband; For APX (VHF+800) using Single-Band Antenna(s)",4,9,3,0,1254,0,2,"No Drawing",18,"Original Special Order","","Special Order"]
[null,null,null,"X",null,null,null,null,null,"INVALID COMBO",800,"X",null,null,"X","ALL","XB-Only","SUITCASE-DVRS(800) Crossband/No Inband; For APX (VHF+800) using One All-Band Antenna",4,9,3,1,1255,0,2,"No Drawing",18,"Original Special Order","","Special Order"]
[null,null,null,"X",null,null,null,null,null,"INVALID COMBO",800,"X",null,null,"X","USER","XB-Only","SUITCASE-DVRS(800) Crossband/No Inband; For APX (VHF+800) using Unknown or User-Defined Antenna",4,9,3,2,1256,0,2,"No Drawing",18,null,"","Special Order"]
[null,null,null,null,"X",null,"X",null,null,"INVALID COMBO",800,"X",null,null,"X","USER","IB+XB","SUITCASE-DVRS(800) Inband & Crossband; For APX (VHF+800) using Unknown or User-Defined Antenna",4,9,5,2,1262,0,2,"No Drawing",10,null,""]
[null,null,null,null,null,null,"X",null,null,"INVALID COMBO",800,null,"X",null,"X","USER","IB-Only","SUITCASE-DVRS(800) Inband/No Crossband; For APX (UHF+800) using Unknown or User-Defined Antenna",4,10,1,2,1267,0,2,"No Drawing",6,null,""]
[null,"X",null,null,null,null,null,null,"X","INVALID COMBO",800,null,"X",null,"X","SINGLE","XB-Only","SUITCASE-DVRS(800) Crossband/No Inband; For APX (UHF+800) using Single-Band Antenna(s)",4,10,3,0,1271,0,2,"No Drawing",18,"Original Special Order","","Special Order"]
[null,null,null,"X",null,null,null,null,null,"INVALID COMBO",800,null,"X",null,"X","ALL","XB-Only","SUITCASE-DVRS(800) Crossband/No Inband; For APX (UHF+800) using One All-Band Antenna",4,10,3,1,1272,0,2,"No Drawing",18,"Original Special Order","","Special Order"]
[null,null,null,"X",null,null,null,null,null,"INVALID COMBO",800,null,"X",null,"X","USER","XB-Only","SUITCASE-DVRS(800) Crossband/No Inband; For APX (UHF+800) using Unknown or User-Defined Antenna",4,10,3,2,1273,0,2,"No Drawing",18,null,"","Special Order"]
[null,null,null,null,"X",null,"X",null,null,"INVALID COMBO",800,null,"X",null,"X","USER","IB+XB","SUITCASE-DVRS(800) Inband & Crossband; For APX (UHF+800) using Unknown or User-Defined Antenna",4,10,5,2,1279,0,2,"No Drawing",10,null,""]
[null,null,null,null,null,null,null,null,null,"INVALID COMBO",800,"X","X",null,"X","SINGLE","IB-Only","SUITCASE-DVRS(800) Inband/No Crossband; For APX (VHF+UHF+800) using Single-Band Antenna(s)",4,11,1,0,1282,0,3,"No Drawing",8,"3-Band Single Antenna","INVALID COMBO"]
[null,null,null,null,null,null,"X",null,null,"INVALID COMBO",800,"X","X",null,"X","USER","IB-Only","SUITCASE-DVRS(800) Inband/No Crossband; For APX (VHF+UHF+800) using Unknown or User-Defined Antenna",4,11,1,2,1284,0,3,"No Drawing",6,null,""]
[null,null,null,null,null,null,null,null,null,"INVALID COMBO",800,"X","X",null,"X","SINGLE","XB-Only","SUITCASE-DVRS(800) Crossband/No Inband; For APX (VHF+UHF+800) using Single-Band Antenna(s)",4,11,3,0,1288,0,3,"No Drawing",18,"3-Band Single Antenna","INVALID COMBO","Special Order"]
[null,null,null,null,null,"X",null,null,null,"INVALID COMBO",800,"X","X",null,"X","ALL","XB-Only","SUITCASE-DVRS(800) Crossband/No Inband; For APX (VHF+UHF+800) using One All-Band Antenna",4,11,3,1,1289,0,3,"No Drawing",18,"Original Special Order","","Special Order"]
[null,null,null,null,null,"X",null,null,null,"INVALID COMBO",800,"X","X",null,"X","USER","XB-Only","SUITCASE-DVRS(800) Crossband/No Inband; For APX (VHF+UHF+800) using Unknown or User-Defined Antenna",4,11,3,2,1290,0,3,"No Drawing",18,null,"","Special Order"]
[null,null,null,null,null,null,null,null,null,"INVALID COMBO",800,"X","X",null,"X","SINGLE","IB+XB","SUITCASE-DVRS(800) Inband & Crossband; For APX (VHF+UHF+800) using Single-Band Antenna(s)",4,11,5,0,1294,0,3,"No Drawing",8,"3-Band Single Antenna","INVALID COMBO"]
[null,null,null,null,"X",null,"X",null,null,"INVALID COMBO",800,"X","X",null,"X","USER","IB+XB","SUITCASE-DVRS(800) Inband & Crossband; For APX (VHF+UHF+800) using Unknown or User-Defined Antenna",4,11,5,2,1296,0,3,"No Drawing",10,null,""]
["X",null,null,null,null,null,"X",null,null,"INVALID COMBO",800,null,null,"X","X","USER","IB-Forced","SUITCASE-DVRS(800) Inband; For APX (700+800) using Unknown or User-Defined Antenna",4,12,2,2,1304,0,1,"No Drawing",7,"Single MSU Band",""]
[null,null,null,null,null,null,null,null,null,"INVALID COMBO",800,null,null,"X","X","SINGLE","XB-Only","SUITCASE-DVRS(800) Crossband/No Inband; For APX (700+800) using Single-Band Antenna(s)",4,12,3,0,1305,0,1,"No Drawing",0,"Illogical terminology","INVALID COMBO","INVALID COMBO"]
[null,null,null,null,null,null,null,null,null,"INVALID COMBO",800,null,null,"X","X","ALL","XB-Only","SUITCASE-DVRS(800) Crossband/No Inband; For APX (700+800) using One All-Band Antenna",4,12,3,1,1306,0,1,"No Drawing",0,"Illogical terminology","INVALID COMBO","INVALID COMBO"]
[null,null,null,null,null,null,null,null,null,"INVALID COMBO",800,null,null,"X","X","USER","XB-Only","SUITCASE-DVRS(800) Crossband/No Inband; For APX (700+800) using Unknown or User-Defined Antenna",4,12,3,2,1307,0,1,"No Drawing",0,"Illogical terminology","INVALID COMBO","INVALID COMBO"]
[null,null,null,null,null,null,"X",null,null,"INVALID COMBO",800,"X",null,"X","X","USER","IB-Only","SUITCASE-DVRS(800) Inband/No Crossband; For APX (VHF+700+800) using Unknown or User-Defined Antenna",4,13,1,2,1318,0,2,"No Drawing",6,null,""]
[null,"X",null,null,null,null,null,null,"X","INVALID COMBO",800,"X",null,"X","X","SINGLE","XB-Only","SUITCASE-DVRS(800) Crossband/No Inband; For APX (VHF+700+800) using Single-Band Antenna(s)",4,13,3,0,1322,0,2,"No Drawing",18,"Original Special Order","","Special Order"]
[null,null,null,"X",null,null,null,null,null,"INVALID COMBO",800,"X",null,"X","X","ALL","XB-Only","SUITCASE-DVRS(800) Crossband/No Inband; For APX (VHF+700+800) using One All-Band Antenna",4,13,3,1,1323,0,2,"No Drawing",18,"Original Special Order","","Special Order"]
[null,null,null,"X",null,null,null,null,null,"INVALID COMBO",800,"X",null,"X","X","USER","XB-Only","SUITCASE-DVRS(800) Crossband/No Inband; For APX (VHF+700+800) using Unknown or User-Defined Antenna",4,13,3,2,1324,0,2,"No Drawing",18,null,"","Special Order"]
[null,null,null,null,"X",null,"X",null,null,"INVALID COMBO",800,"X",null,"X","X","USER","IB+XB","SUITCASE-DVRS(800) Inband & Crossband; For APX (VHF+700+800) using Unknown or User-Defined Antenna",4,13,5,2,1330,0,2,"No Drawing",10,null,""]
[null,null,null,null,null,null,"X",null,null,"INVALID COMBO",800,null,"X","X","X","USER","IB-Only","SUITCASE-DVRS(800) Inband/No Crossband; For APX (UHF+700+800) using Unknown or User-Defined Antenna",4,14,1,2,1335,0,2,"No Drawing",6,null,""]
[null,"X",null,null,null,null,null,null,"X","INVALID COMBO",800,null,"X","X","X","SINGLE","XB-Only","SUITCASE-DVRS(800) Crossband/No Inband; For APX (UHF+700+800) using Single-Band Antenna(s)",4,14,3,0,1339,0,2,"No Drawing",18,"Original Special Order","","Special Order"]
[null,null,null,"X",null,null,null,null,null,"INVALID COMBO",800,null,"X","X","X","ALL","XB-Only","SUITCASE-DVRS(800) Crossband/No Inband; For APX (UHF+700+800) using One All-Band Antenna",4,14,3,1,1340,0,2,"No Drawing",18,"Original Special Order","","Special Order"]
[null,null,null,"X",null,null,null,null,null,"INVALID COMBO",800,null,"X","X","X","USER","XB-Only","SUITCASE-DVRS(800) Crossband/No Inband; For APX (UHF+700+800) using Unknown or User-Defined Antenna",4,14,3,2,1341,0,2,"No Drawing",18,null,"","Special Order"]
[null,null,null,null,"X",null,"X",null,null,"INVALID COMBO",800,null,"X","X","X","USER","IB+XB","SUITCASE-DVRS(800) Inband & Crossband; For APX (UHF+700+800) using Unknown or User-Defined Antenna",4,14,5,2,1347,0,2,"No Drawing",10,null,""]
[null,null,null,null,null,null,null,null,null,"INVALID COMBO",800,"X","X","X","X","SINGLE","IB-Only","SUITCASE-DVRS(800) Inband/No Crossband; For APX (VHF+UHF+700+800) using Single-Band Antenna(s)",4,15,1,0,1350,0,3,"No Drawing",8,"3-Band Single Antenna","INVALID COMBO"]
[null,null,null,null,null,null,"X",null,null,"INVALID COMBO",800,"X","X","X","X","USER","IB-Only","SUITCASE-DVRS(800) Inband/No Crossband; For APX (VHF+UHF+700+800) using Unknown or User-Defined Antenna",4,15,1,2,1352,0,3,"No Drawing",6,null,""]
[null,null,null,null,null,null,null,null,null,"INVALID COMBO",800,"X","X","X","X","SINGLE","XB-Only","SUITCASE-DVRS(800) Crossband/No Inband; For APX (VHF+UHF+700+800) using Single-Band Antenna(s)",4,15,3,0,1356,0,3,"No Drawing",18,"3-Band Single Antenna","INVALID COMBO","Special Order"]
[null,null,null,null,null,"X",null,null,null,{"$f":"IF(OR(AND(Y263>2,$P263<>\"All\"),$P263=\"USER\",$Q263=\"XB-Only\"),\"INVALID COMBO\",\"\")","v":"INVALID COMBO"},800,"X","X","X","X","ALL","XB-Only",{"$f":"$K$6&\"(\"&$K263&\")\"&\" \"&VLOOKUP($Q263,RPTCodes,2,FALSE) &\"; For APX (\"&VLOOKUP($T263,BAND_NAMES,2)&\") using \"&VLOOKUP($P263,ANTcodes,3,FALSE)","v":"SUITCASE-DVRS(800) Crossband/No Inband; For APX (VHF+UHF+700+800) using One All-Band Antenna"},{"$f":"VLOOKUP(K263,Freq_Bands,2)","v":4},{"$f":"IF(L263=\"X\",1,0)+IF(M263=\"X\",2,0)+IF(N263=\"X\",4,0)+IF(O263=\"X\",8,0)","v":15},{"$f":"VLOOKUP(Q263,RPTCodes,4,FALSE)","v":3},{"$f":"VLOOKUP(P263,ANTcodes,2,FALSE)","v":1},{"$f":"$V263*MULT_ANT+$U263*MULT_RPT+$T263*MULT_MRF+$S263*MULT_VRF","v":1357},{"$f":"IF(LEFT($J263,4)=\"INVA\",$J$4,IF($A263=\"X\",$A$4,0)+IF($B263=\"X\",$B$4,0)+IF($D263=\"X\",$D$4,0)+IF($E263=\"X\",$E$4,0)+IF($F263=\"X\",$F$4,0)+IF($G263=\"X\",$G$4,0)+IF($I263=\"X\",$I$4,0)+IF($C263=\"X\",$C$4,0))","v":0},{"$f":"COUNTA(L263:M263)+IF(RIGHT(N263&O263,1)=\"X\",1,0)","v":3},"No Drawing",18,"Original Special Order",{"$f":"IF(COUNTIF($A263:$H263, \"<>\"&\"\")=0,\"INVALID COMBO\",\"\")","v":""},"Special Order"]
[null,null,null,null,null,"X",null,null,null,"INVALID COMBO",800,"X","X","X","X","USER","XB-Only","SUITCASE-DVRS(800) Crossband/No Inband; For APX (VHF+UHF+700+800) using Unknown or User-Defined Antenna",4,15,3,2,1358,0,3,"No Drawing",18,null,"","Special Order"]
[null,null,null,null,null,null,null,null,null,"INVALID COMBO",800,"X","X","X","X","SINGLE","IB+XB","SUITCASE-DVRS(800) Inband & Crossband; For APX (VHF+UHF+700+800) using Single-Band Antenna(s)",4,15,5,0,1362,0,3,"No Drawing",8,"3-Band Single Antenna","INVALID COMBO"]
[null,null,null,null,"X",null,"X",null,null,"INVALID COMBO",800,"X","X","X","X","USER","IB+XB","SUITCASE-DVRS(800) Inband & Crossband; For APX (VHF+UHF+700+800) using Unknown or User-Defined Antenna",4,15,5,2,1364,0,3,"No Drawing",10,null,""]
[null,null,null,null,null,null,"X",null,null,"","VHF","X","X",null,null,"ALL","IB-Only","SUITCASE-DVRS(VHF) Inband/No Crossband; For APX (VHF+UHF) using One All-Band Antenna",1,3,1,1,328,6,2,"No Drawing",6,null,""]
[null,null,null,null,null,null,"X",null,null,"","VHF","X",null,"X",null,"ALL","IB-Only","SUITCASE-DVRS(VHF) Inband/No Crossband; For APX (VHF+700) using One All-Band Antenna",1,5,1,1,362,6,2,"No Drawing",6,null,""]
[null,null,null,null,null,null,"X",null,null,"","VHF","X","X","X",null,"ALL","IB-Only","SUITCASE-DVRS(VHF) Inband/No Crossband; For APX (VHF+UHF+700) using One All-Band Antenna",1,7,1,1,396,6,3,"No Drawing",6,null,""]
[null,null,null,null,null,null,"X",null,null,"","VHF","X",null,null,"X","ALL","IB-Only","SUITCASE-DVRS(VHF) Inband/No Crossband; For APX (VHF+800) using One All-Band Antenna",1,9,1,1,430,6,2,"No Drawing",6,null,""]
[null,null,null,null,null,null,"X",null,null,"","VHF","X","X",null,"X","ALL","IB-Only","SUITCASE-DVRS(VHF) Inband/No Crossband; For APX (VHF+UHF+800) using One All-Band Antenna",1,11,1,1,464,6,3,"No Drawing",6,null,""]
[null,null,null,null,null,null,"X",null,null,"","VHF","X",null,"X","X","ALL","IB-Only","SUITCASE-DVRS(VHF) Inband/No Crossband; For APX (VHF+700+800) using One All-Band Antenna",1,13,1,1,498,6,2,"No Drawing",6,null,""]
[null,null,null,null,null,null,"X",null,null,"","VHF","X","X","X","X","ALL","IB-Only","SUITCASE-DVRS(VHF) Inband/No Crossband; For APX (VHF+UHF+700+800) using One All-Band Antenna",1,15,1,1,532,6,3,"No Drawing",6,null,""]
[null,null,null,null,null,null,"X",null,null,"","UHF","X","X",null,null,"ALL","IB-Only","SUITCASE-DVRS(UHF) Inband/No Crossband; For APX (VHF+UHF) using One All-Band Antenna",2,3,1,1,601,6,2,"No Drawing",6,null,""]
[null,null,null,null,null,null,"X",null,null,"","UHF",null,"X","X",null,"ALL","IB-Only","SUITCASE-DVRS(UHF) Inband/No Crossband; For APX (UHF+700) using One All-Band Antenna",2,6,1,1,652,6,2,"No Drawing",6,null,""]
[null,null,null,null,null,null,"X",null,null,"","UHF","X","X","X",null,"ALL","IB-Only","SUITCASE-DVRS(UHF) Inband/No Crossband; For APX (VHF+UHF+700) using One All-Band Antenna",2,7,1,1,669,6,3,"No Drawing",6,null,""]
[null,null,null,null,null,null,"X",null,null,"","UHF",null,"X",null,"X","ALL","IB-Only","SUITCASE-DVRS(UHF) Inband/No Crossband; For APX (UHF+800) using One All-Band Antenna",2,10,1,1,720,6,2,"No Drawing",6,null,""]
[null,null,null,null,null,null,"X",null,null,"","UHF","X","X",null,"X","ALL","IB-Only","SUITCASE-DVRS(UHF) Inband/No Crossband; For APX (VHF+UHF+800) using One All-Band Antenna",2,11,1,1,737,6,3,"No Drawing",6,null,""]
[null,null,null,null,null,null,"X",null,null,"","UHF",null,"X","X","X","ALL","IB-Only","SUITCASE-DVRS(UHF) Inband/No Crossband; For APX (UHF+700+800) using One All-Band Antenna",2,14,1,1,788,6,2,"No Drawing",6,null,""]
[null,null,null,null,null,null,"X",null,null,"","UHF","X","X","X","X","ALL","IB-Only","SUITCASE-DVRS(UHF) Inband/No Crossband; For APX (VHF+UHF+700+800) using One All-Band Antenna",2,15,1,1,805,6,3,"No Drawing",6,null,""]
[null,null,null,null,null,null,"X",null,null,"",700,"X",null,"X",null,"ALL","IB-Only","SUITCASE-DVRS(700) Inband/No Crossband; For APX (VHF+700) using One All-Band Antenna",3,5,1,1,908,6,2,"No Drawing",6,null,""]
[null,null,null,null,null,null,"X",null,null,"",700,null,"X","X",null,"ALL","IB-Only","SUITCASE-DVRS(700) Inband/No Crossband; For APX (UHF+700) using One All-Band Antenna",3,6,1,1,925,6,2,"No Drawing",6,null,""]
[null,null,null,null,null,null,"X",null,null,"",700,"X","X","X",null,"ALL","IB-Only","SUITCASE-DVRS(700) Inband/No Crossband; For APX (VHF+UHF+700) using One All-Band Antenna",3,7,1,1,942,6,3,"No Drawing",6,null,""]
[null,null,null,null,null,null,"X",null,null,"",700,"X",null,null,"X","ALL","IB-Only","SUITCASE-DVRS(700) Inband/No Crossband; For APX (VHF+800) using One All-Band Antenna",3,9,1,1,976,6,2,"No Drawing",6,null,""]
[null,null,null,null,null,null,"X",null,null,"",700,null,"X",null,"X","ALL","IB-Only","SUITCASE-DVRS(700) Inband/No Crossband; For APX (UHF+800) using One All-Band Antenna",3,10,1,1,993,6,2,"No Drawing",6,null,""]
[null,null,null,null,null,null,"X",null,null,"",700,"X","X",null,"X","ALL","IB-Only","SUITCASE-DVRS(700) Inband/No Crossband; For APX (VHF+UHF+800) using One All-Band Antenna",3,11,1,1,1010,6,3,"No Drawing",6,null,""]
[null,null,null,null,null,null,"X",null,null,"",700,"X",null,"X","X","ALL","IB-Only","SUITCASE-DVRS(700) Inband/No Crossband; For APX (VHF+700+800) using One All-Band Antenna",3,13,1,1,1044,6,2,"No Drawing",6,null,""]
[null,null,null,null,null,null,"X",null,null,"",700,null,"X","X","X","ALL","IB-Only","SUITCASE-DVRS(700) Inband/No Crossband; For APX (UHF+700+800) using One All-Band Antenna",3,14,1,1,1061,6,2,"No Drawing",6,null,""]
[null,null,null,null,null,null,"X",null,null,"",700,"X","X","X","X","ALL","IB-Only","SUITCASE-DVRS(700) Inband/No Crossband; For APX (VHF+UHF+700+800) using One All-Band Antenna",3,15,1,1,1078,6,3,"No Drawing",6,null,""]
[null,null,null,null,null,null,"X",null,null,"",800,"X",null,"X",null,"ALL","IB-Only","SUITCASE-DVRS(800) Inband/No Crossband; For APX (VHF+700) using One All-Band Antenna",4,5,1,1,1181,6,2,"No Drawing",6,null,""]
[null,null,null,null,null,null,"X",null,null,"",800,null,"X","X",null,"ALL","IB-Only","SUITCASE-DVRS(800) Inband/No Crossband; For APX (UHF+700) using One All-Band Antenna",4,6,1,1,1198,6,2,"No Drawing",6,null,""]
[null,null,null,null,null,null,"X",null,null,"",800,"X","X","X",null,"ALL","IB-Only","SUITCASE-DVRS(800) Inband/No Crossband; For APX (VHF+UHF+700) using One All-Band Antenna",4,7,1,1,1215,6,3,"No Drawing",6,null,""]
[null,null,null,null,null,null,"X",null,null,"",800,"X",null,null,"X","ALL","IB-Only","SUITCASE-DVRS(800) Inband/No Crossband; For APX (VHF+800) using One All-Band Antenna",4,9,1,1,1249,6,2,"No Drawing",6,null,""]
[null,null,null,null,null,null,"X",null,null,"",800,null,"X",null,"X","ALL","IB-Only","SUITCASE-DVRS(800) Inband/No Crossband; For APX (UHF+800) using One All-Band Antenna",4,10,1,1,1266,6,2,"No Drawing",6,null,""]
[null,null,null,null,null,null,"X",null,null,"",800,"X","X",null,"X","ALL","IB-Only","SUITCASE-DVRS(800) Inband/No Crossband; For APX (VHF+UHF+800) using One All-Band Antenna",4,11,1,1,1283,6,3,"No Drawing",6,null,""]
[null,null,null,null,null,null,"X",null,null,"",800,"X",null,"X","X","ALL","IB-Only","SUITCASE-DVRS(800) Inband/No Crossband; For APX (VHF+700+800) using One All-Band Antenna",4,13,1,1,1317,6,2,"No Drawing",6,null,""]
[null,null,null,null,null,null,"X",null,null,"",800,null,"X","X","X","ALL","IB-Only","SUITCASE-DVRS(800) Inband/No Crossband; For APX (UHF+700+800) using One All-Band Antenna",4,14,1,1,1334,6,2,"No Drawing",6,null,""]
[null,null,null,null,null,null,"X",null,null,"",800,"X","X","X","X","ALL","IB-Only","SUITCASE-DVRS(800) Inband/No Crossband; For APX (VHF+UHF+700+800) using One All-Band Antenna",4,15,1,1,1351,6,3,"No Drawing",6,null,""]
["X",null,null,null,null,null,"X",null,null,"","VHF","X",null,null,null,"SINGLE","IB-Forced","SUITCASE-DVRS(VHF) Inband; For APX (VHF) using Single-Band Antenna(s)",1,1,2,0,296,7,1,"No Drawing",7,"Single MSU Band",""]
["X",null,null,null,null,null,"X",null,null,"","VHF","X",null,null,null,"ALL","IB-Forced","SUITCASE-DVRS(VHF) Inband; For APX (VHF) using One All-Band Antenna",1,1,2,1,297,7,1,"No Drawing",7,"Single MSU Band",""]
["X",null,null,null,null,null,"X",null,null,"","UHF",null,"X",null,null,"SINGLE","IB-Forced","SUITCASE-DVRS(UHF) Inband; For APX (UHF) using Single-Band Antenna(s)",2,2,2,0,586,7,1,"No Drawing",7,"Single MSU Band",""]
["X",null,null,null,null,null,"X",null,null,"","UHF",null,"X",null,null,"ALL","IB-Forced","SUITCASE-DVRS(UHF) Inband; For APX (UHF) using One All-Band Antenna",2,2,2,1,587,7,1,"No Drawing",7,"Single MSU Band",""]
["X",null,null,null,null,null,"X",null,null,"",700,null,null,"X",null,"SINGLE","IB-Forced","SUITCASE-DVRS(700) Inband; For APX (700) using Single-Band Antenna(s)",3,4,2,0,893,7,1,"No Drawing",7,"Single MSU Band",""]
["X",null,null,null,null,null,"X",null,null,"",700,null,null,"X",null,"ALL","IB-Forced","SUITCASE-DVRS(700) Inband; For APX (700) using One All-Band Antenna",3,4,2,1,894,7,1,"No Drawing",7,"Single MSU Band",""]
["X",null,null,null,null,null,"X",null,null,"",700,null,null,null,"X","SINGLE","IB-Forced","SUITCASE-DVRS(700) Inband; For APX (800) using Single-Band Antenna(s)",3,8,2,0,961,7,1,"No Drawing",7,"Single MSU Band",""]
["X",null,null,null,null,null,"X",null,null,"",700,null,null,null,"X","ALL","IB-Forced","SUITCASE-DVRS(700) Inband; For APX (800) using One All-Band Antenna",3,8,2,1,962,7,1,"No Drawing",7,"Single MSU Band",""]
["X",null,null,null,null,null,"X",null,null,"",700,null,null,"X","X","SINGLE","IB-Forced","SUITCASE-DVRS(700) Inband; For APX (700+800) using Single-Band Antenna(s)",3,12,2,0,1029,7,1,"No Drawing",7,"Single MSU Band",""]
["X",null,null,null,null,null,"X",null,null,"",700,null,null,"X","X","ALL","IB-Forced","SUITCASE-DVRS(700) Inband; For APX (700+800) using One All-Band Antenna",3,12,2,1,1030,7,1,"No Drawing",7,"Single MSU Band",""]
["X",null,null,null,null,null,"X",null,null,"",800,null,null,"X",null,"SINGLE","IB-Forced","SUITCASE-DVRS(800) Inband; For APX (700) using Single-Band Antenna(s)",4,4,2,0,1166,7,1,"No Drawing",7,"Single MSU Band",""]
["X",null,null,null,null,null,"X",null,null,"",800,null,null,"X",null,"ALL","IB-Forced","SUITCASE-DVRS(800) Inband; For APX (700) using One All-Band Antenna",4,4,2,1,1167,7,1,"No Drawing",7,"Single MSU Band",""]
["X",null,null,null,null,null,"X",null,null,"",800,null,null,null,"X","SINGLE","IB-Forced","SUITCASE-DVRS(800) Inband; For APX (800) using Single-Band Antenna(s)",4,8,2,0,1234,7,1,"No Drawing",7,"Single MSU Band",""]
["X",null,null,null,null,null,"X",null,null,"",800,null,null,null,"X","ALL","IB-Forced","SUITCASE-DVRS(800) Inband; For APX (800) using One All-Band Antenna",4,8,2,1,1235,7,1,"No Drawing",7,"Single MSU Band",""]
["X",null,null,null,null,null,"X",null,null,"",800,null,null,"X","X","SINGLE","IB-Forced","SUITCASE-DVRS(800) Inband; For APX (700+800) using Single-Band Antenna(s)",4,12,2,0,1302,7,1,"No Drawing",7,"Single MSU Band",""]
["X",null,null,null,null,null,"X",null,null,"",800,null,null,"X","X","ALL","IB-Forced","SUITCASE-DVRS(800) Inband; For APX (700+800) using One All-Band Antenna",4,12,2,1,1303,7,1,"No Drawing",7,"Single MSU Band",""]
[null,null,null,null,"X",null,null,null,null,"","VHF",null,"X","X",null,"ALL","XB-Forced","SUITCASE-DVRS(VHF) Crossband; For APX (UHF+700) using One All-Band Antenna",1,6,4,1,388,20,2,"8D093B216",4,null,""]
[null,null,null,null,"X",null,null,null,null,"","VHF",null,"X",null,"X","ALL","XB-Forced","SUITCASE-DVRS(VHF) Crossband; For APX (UHF+800) using One All-Band Antenna",1,10,4,1,456,20,2,"8D093B216",4,null,""]
[null,null,null,null,"X",null,null,null,null,"","VHF",null,"X","X","X","ALL","XB-Forced","SUITCASE-DVRS(VHF) Crossband; For APX (UHF+700+800) using One All-Band Antenna",1,14,4,1,524,20,2,"8D093B216",4,null,""]
[null,null,null,null,"X",null,null,null,null,"","UHF","X",null,"X",null,"ALL","XB-Forced","SUITCASE-DVRS(UHF) Crossband; For APX (VHF+700) using One All-Band Antenna",2,5,4,1,644,20,2,"8D093B217",4,null,""]
[null,null,null,null,"X",null,null,null,null,"","UHF","X",null,null,"X","ALL","XB-Forced","SUITCASE-DVRS(UHF) Crossband; For APX (VHF+800) using One All-Band Antenna",2,9,4,1,712,20,2,"8D093B217",4,null,""]
[null,null,null,null,"X",null,null,null,null,"","UHF","X",null,"X","X","ALL","XB-Forced","SUITCASE-DVRS(UHF) Crossband; For APX (VHF+700+800) using One All-Band Antenna",2,13,4,1,780,20,2,"8D093B217",4,null,""]
[null,null,null,null,"X",null,null,null,null,"",700,"X","X",null,null,"ALL","XB-Forced","SUITCASE-DVRS(700) Crossband; For APX (VHF+UHF) using One All-Band Antenna",3,3,4,1,883,20,2,"8D093B218",4,null,""]
[null,null,null,null,"X",null,null,null,null,"",800,"X","X",null,null,"ALL","XB-Forced","SUITCASE-DVRS(800) Crossband; For APX (VHF+UHF) using One All-Band Antenna",4,3,4,1,1156,20,2,"8D093B218",4,null,""]
[null,null,"X",null,null,null,null,null,null,"","VHF",null,"X","X",null,"SINGLE","XB-Forced","SUITCASE-DVRS(VHF) Crossband; For APX (UHF+700) using Single-Band Antenna(s)",1,6,4,0,387,23,2,"8D093B116",17,null,""]
[null,null,"X",null,null,null,null,null,null,"","VHF",null,"X",null,"X","SINGLE","XB-Forced","SUITCASE-DVRS(VHF) Crossband; For APX (UHF+800) using Single-Band Antenna(s)",1,10,4,0,455,23,2,"8D093B116",17,null,""]
[null,null,"X",null,null,null,null,null,null,"","VHF",null,"X","X","X","SINGLE","XB-Forced","SUITCASE-DVRS(VHF) Crossband; For APX (UHF+700+800) using Single-Band Antenna(s)",1,14,4,0,523,23,2,"8D093B116",17,null,""]
[null,null,"X",null,null,null,null,null,null,"","UHF","X",null,"X",null,"SINGLE","XB-Forced","SUITCASE-DVRS(UHF) Crossband; For APX (VHF+700) using Single-Band Antenna(s)",2,5,4,0,643,23,2,"8D093B117",17,null,""]
[null,null,"X",null,null,null,null,null,null,{"$f":"IF(OR(AND(Y327>2,$P327<>\"All\"),$P327=\"USER\",$Q327=\"XB-Only\"),\"INVALID COMBO\",\"\")","v":""},"UHF","X",null,null,"X","SINGLE","XB-Forced",{"$f":"$K$6&\"(\"&$K327&\")\"&\" \"&VLOOKUP($Q327,RPTCodes,2,FALSE) &\"; For APX (\"&VLOOKUP($T327,BAND_NAMES,2)&\") using \"&VLOOKUP($P327,ANTcodes,3,FALSE)","v":"SUITCASE-DVRS(UHF) Crossband; For APX (VHF+800) using Single-Band Antenna(s)"},{"$f":"VLOOKUP(K327,Freq_Bands,2)","v":2},{"$f":"IF(L327=\"X\",1,0)+IF(M327=\"X\",2,0)+IF(N327=\"X\",4,0)+IF(O327=\"X\",8,0)","v":9},{"$f":"VLOOKUP(Q327,RPTCodes,4,FALSE)","v":4},{"$f":"VLOOKUP(P327,ANTcodes,2,FALSE)","v":0},{"$f":"$V327*MULT_ANT+$U327*MULT_RPT+$T327*MULT_MRF+$S327*MULT_VRF","v":711},{"$f":"IF(LEFT($J327,4)=\"INVA\",$J$4,IF($A327=\"X\",$A$4,0)+IF($B327=\"X\",$B$4,0)+IF($D327=\"X\",$D$4,0)+IF($E327=\"X\",$E$4,0)+IF($F327=\"X\",$F$4,0)+IF($G327=\"X\",$G$4,0)+IF($I327=\"X\",$I$4,0)+IF($C327=\"X\",$C$4,0))","v":23},{"$f":"COUNTA(L327:M327)+IF(RIGHT(N327&O327,1)=\"X\",1,0)","v":2},"8D093B117",17,null,{"$f":"IF(COUNTIF($A327:$H327, \"<>\"&\"\")=0,\"INVALID COMBO\",\"\")","v":""}]
[null,null,"X",null,null,null,null,null,null,"","UHF","X",null,"X","X","SINGLE","XB-Forced","SUITCASE-DVRS(UHF) Crossband; For APX (VHF+700+800) using Single-Band Antenna(s)",2,13,4,0,779,23,2,"8D093B117",17,null,""]
[null,null,"X",null,null,null,null,null,null,"",700,"X","X",null,null,"SINGLE","XB-Forced","SUITCASE-DVRS(700) Crossband; For APX (VHF+UHF) using Single-Band Antenna(s)",3,3,4,0,882,23,2,"8D093B118",17,null,""]
[null,null,"X",null,null,null,null,null,null,"",800,"X","X",null,null,"SINGLE","XB-Forced","SUITCASE-DVRS(800) Crossband; For APX (VHF+UHF) using Single-Band Antenna(s)",4,3,4,0,1155,23,2,"8D093B118",17,null,""]
[null,"X",null,null,null,null,"X",null,null,"","VHF","X","X",null,null,"SINGLE","IB-Only","SUITCASE-DVRS(VHF) Inband/No Crossband; For APX (VHF+UHF) using Single-Band Antenna(s)",1,3,1,0,327,25,2,"8J093B1103",8,null,""]
[null,"X",null,null,null,null,"X",null,null,"","VHF","X","X",null,null,"SINGLE","IB+XB","SUITCASE-DVRS(VHF) Inband & Crossband; For APX (VHF+UHF) using Single-Band Antenna(s)",1,3,5,0,339,25,2,"8J093B170",8,null,""]
[null,"X",null,null,null,null,"X",null,null,"","VHF","X",null,"X",null,"SINGLE","IB-Only","SUITCASE-DVRS(VHF) Inband/No Crossband; For APX (VHF+700) using Single-Band Antenna(s)",1,5,1,0,361,25,2,"8J093B1104",8,null,""]
[null,"X",null,null,null,null,"X",null,null,"","VHF","X",null,"X",null,"SINGLE","IB+XB","SUITCASE-DVRS(VHF) Inband & Crossband; For APX (VHF+700) using Single-Band Antenna(s)",1,5,5,0,373,25,2,"8J093B171",8,null,""]
[null,"X",null,null,null,null,"X",null,null,"","VHF","X",null,null,"X","SINGLE","IB-Only","SUITCASE-DVRS(VHF) Inband/No Crossband; For APX (VHF+800) using Single-Band Antenna(s)",1,9,1,0,429,25,2,"8J093B1104",8,null,""]
[null,"X",null,null,null,null,"X",null,null,"","VHF","X",null,null,"X","SINGLE","IB+XB","SUITCASE-DVRS(VHF) Inband & Crossband; For APX (VHF+800) using Single-Band Antenna(s)",1,9,5,0,441,25,2,"8J093B171",8,null,""]
[null,"X",null,null,null,null,"X",null,null,"","VHF","X",null,"X","X","SINGLE","IB-Only","SUITCASE-DVRS(VHF) Inband/No Crossband; For APX (VHF+700+800) using Single-Band Antenna(s)",1,13,1,0,497,25,2,"8J093B1104",8,null,""]
[null,"X",null,null,null,null,"X",null,null,"","VHF","X",null,"X","X","SINGLE","IB+XB","SUITCASE-DVRS(VHF) Inband & Crossband; For APX (VHF+700+800) using Single-Band Antenna(s)",1,13,5,0,509,25,2,"8J093B171",8,null,""]
[null,"X",null,null,null,null,"X",null,null,"","UHF","X","X",null,null,"SINGLE","IB-Only","SUITCASE-DVRS(UHF) Inband/No Crossband; For APX (VHF+UHF) using Single-Band Antenna(s)",2,3,1,0,600,25,2,"8D093B1105",8,null,""]
[null,"X",null,null,null,null,"X",null,null,"","UHF","X","X",null,null,"SINGLE","IB+XB","SUITCASE-DVRS(UHF) Inband & Crossband; For APX (VHF+UHF) using Single-Band Antenna(s)",2,3,5,0,612,25,2,"8D093B172",8,null,""]
[null,"X",null,null,null,null,"X",null,null,"","UHF",null,"X","X",null,"SINGLE","IB-Only","SUITCASE-DVRS(UHF) Inband/No Crossband; For APX (UHF+700) using Single-Band Antenna(s)",2,6,1,0,651,25,2,"8D093B1106",8,null,""]
[null,"X",null,null,null,null,"X",null,null,"","UHF",null,"X","X",null,"SINGLE","IB+XB","SUITCASE-DVRS(UHF) Inband & Crossband; For APX (UHF+700) using Single-Band Antenna(s)",2,6,5,0,663,25,2,"8D093B173",8,null,""]
[null,"X",null,null,null,null,"X",null,null,"","UHF",null,"X",null,"X","SINGLE","IB-Only","SUITCASE-DVRS(UHF) Inband/No Crossband; For APX (UHF+800) using Single-Band Antenna(s)",2,10,1,0,719,25,2,"8D093B1106",8,null,""]
[null,"X",null,null,null,null,"X",null,null,"","UHF",null,"X",null,"X","SINGLE","IB+XB","SUITCASE-DVRS(UHF) Inband & Crossband; For APX (UHF+800) using Single-Band Antenna(s)",2,10,5,0,731,25,2,"8D093B173",8,null,""]
[null,"X",null,null,null,null,"X",null,null,"","UHF",null,"X","X","X","SINGLE","IB-Only","SUITCASE-DVRS(UHF) Inband/No Crossband; For APX (UHF+700+800) using Single-Band Antenna(s)",2,14,1,0,787,25,2,"8D093B1106",8,null,""]
[null,"X",null,null,null,null,"X",null,null,"","UHF",null,"X","X","X","SINGLE","IB+XB","SUITCASE-DVRS(UHF) Inband & Crossband; For APX (UHF+700+800) using Single-Band Antenna(s)",2,14,5,0,799,25,2,"8D093B173",8,null,""]
[null,"X",null,null,null,null,"X",null,null,"",700,"X",null,"X",null,"SINGLE","IB-Only","SUITCASE-DVRS(700) Inband/No Crossband; For APX (VHF+700) using Single-Band Antenna(s)",3,5,1,0,907,25,2,"8J093B1107",8,null,""]
[null,"X",null,null,null,null,"X",null,null,"",700,"X",null,"X",null,"SINGLE","IB+XB","SUITCASE-DVRS(700) Inband & Crossband; For APX (VHF+700) using Single-Band Antenna(s)",3,5,5,0,919,25,2,"8D093B174",8,null,""]
[null,"X",null,null,null,null,"X",null,null,"",700,null,"X","X",null,"SINGLE","IB-Only","SUITCASE-DVRS(700) Inband/No Crossband; For APX (UHF+700) using Single-Band Antenna(s)",3,6,1,0,924,25,2,"8D093B1108",8,null,""]
[null,"X",null,null,null,null,"X",null,null,"",700,null,"X","X",null,"SINGLE","IB+XB","SUITCASE-DVRS(700) Inband & Crossband; For APX (UHF+700) using Single-Band Antenna(s)",3,6,5,0,936,25,2,"8D093B175",8,null,""]
[null,"X",null,null,null,null,"X",null,null,"",700,"X",null,null,"X","SINGLE","IB-Only","SUITCASE-DVRS(700) Inband/No Crossband; For APX (VHF+800) using Single-Band Antenna(s)",3,9,1,0,975,25,2,"8J093B1107",8,null,""]
[null,"X",null,null,null,null,"X",null,null,"",700,"X",null,null,"X","SINGLE","IB+XB","SUITCASE-DVRS(700) Inband & Crossband; For APX (VHF+800) using Single-Band Antenna(s)",3,9,5,0,987,25,2,"8D093B174",8,null,""]
[null,"X",null,null,null,null,"X",null,null,"",700,null,"X",null,"X","SINGLE","IB-Only","SUITCASE-DVRS(700) Inband/No Crossband; For APX (UHF+800) using Single-Band Antenna(s)",3,10,1,0,992,25,2,"8D093B1108",8,null,""]
[null,"X",null,null,null,null,"X",null,null,"",700,null,"X",null,"X","SINGLE","IB+XB","SUITCASE-DVRS(700) Inband & Crossband; For APX (UHF+800) using Single-Band Antenna(s)",3,10,5,0,1004,25,2,"8D093B175",8,null,""]
[null,"X",null,null,null,null,"X",null,null,"",700,"X",null,"X","X","SINGLE","IB-Only","SUITCASE-DVRS(700) Inband/No Crossband; For APX (VHF+700+800) using Single-Band Antenna(s)",3,13,1,0,1043,25,2,"8J093B1107",8,null,""]
[null,"X",null,null,null,null,"X",null,null,"",700,"X",null,"X","X","SINGLE","IB+XB","SUITCASE-DVRS(700) Inband & Crossband; For APX (VHF+700+800) using Single-Band Antenna(s)",3,13,5,0,1055,25,2,"8D093B174",8,null,""]
[null,"X",null,null,null,null,"X",null,null,"",700,null,"X","X","X","SINGLE","IB-Only","SUITCASE-DVRS(700) Inband/No Crossband; For APX (UHF+700+800) using Single-Band Antenna(s)",3,14,1,0,1060,25,2,"8D093B1108",8,null,""]
[null,"X",null,null,null,null,"X",null,null,"",700,null,"X","X","X","SINGLE","IB+XB","SUITCASE-DVRS(700) Inband & Crossband; For APX (UHF+700+800) using Single-Band Antenna(s)",3,14,5,0,1072,25,2,"8D093B175",8,null,""]
[null,"X",null,null,null,null,"X",null,null,"",800,"X",null,"X",null,"SINGLE","IB-Only","SUITCASE-DVRS(800) Inband/No Crossband; For APX (VHF+700) using Single-Band Antenna(s)",4,5,1,0,1180,25,2,"8J093B1107",8,null,""]
[null,"X",null,null,null,null,"X",null,null,"",800,"X",null,"X",null,"SINGLE","IB+XB","SUITCASE-DVRS(800) Inband & Crossband; For APX (VHF+700) using Single-Band Antenna(s)",4,5,5,0,1192,25,2,"8D093B174",8,null,""]
[null,"X",null,null,null,null,"X",null,null,"",800,null,"X","X",null,"SINGLE","IB-Only","SUITCASE-DVRS(800) Inband/No Crossband; For APX (UHF+700) using Single-Band Antenna(s)",4,6,1,0,1197,25,2,"8D093B1108",8,null,""]
[null,"X",null,null,null,null,"X",null,null,"",800,null,"X","X",null,"SINGLE","IB+XB","SUITCASE-DVRS(800) Inband & Crossband; For APX (UHF+700) using Single-Band Antenna(s)",4,6,5,0,1209,25,2,"8D093B175",8,null,""]
[null,"X",null,null,null,null,"X",null,null,"",800,"X",null,null,"X","SINGLE","IB-Only","SUITCASE-DVRS(800) Inband/No Crossband; For APX (VHF+800) using Single-Band Antenna(s)",4,9,1,0,1248,25,2,"8J093B1107",8,null,""]
[null,"X",null,null,null,null,"X",null,null,"",800,"X",null,null,"X","SINGLE","IB+XB","SUITCASE-DVRS(800) Inband & Crossband; For APX (VHF+800) using Single-Band Antenna(s)",4,9,5,0,1260,25,2,"8D093B174",8,null,""]
[null,"X",null,null,null,null,"X",null,null,"",800,null,"X",null,"X","SINGLE","IB-Only","SUITCASE-DVRS(800) Inband/No Crossband; For APX (UHF+800) using Single-Band Antenna(s)",4,10,1,0,1265,25,2,"8D093B1108",8,null,""]
[null,"X",null,null,null,null,"X",null,null,"",800,null,"X",null,"X","SINGLE","IB+XB","SUITCASE-DVRS(800) Inband & Crossband; For APX (UHF+800) using Single-Band Antenna(s)",4,10,5,0,1277,25,2,"8D093B175",8,null,""]
[null,"X",null,null,null,null,"X",null,null,"",800,"X",null,"X","X","SINGLE","IB-Only","SUITCASE-DVRS(800) Inband/No Crossband; For APX (VHF+700+800) using Single-Band Antenna(s)",4,13,1,0,1316,25,2,"8J093B1107",8,null,""]
[null,"X",null,null,null,null,"X",null,null,"",800,"X",null,"X","X","SINGLE","IB+XB","SUITCASE-DVRS(800) Inband & Crossband; For APX (VHF+700+800) using Single-Band Antenna(s)",4,13,5,0,1328,25,2,"8D093B174",8,null,""]
[null,"X",null,null,null,null,"X",null,null,"",800,null,"X","X","X","SINGLE","IB-Only","SUITCASE-DVRS(800) Inband/No Crossband; For APX (UHF+700+800) using Single-Band Antenna(s)",4,14,1,0,1333,25,2,"8D093B1108",8,null,""]
[null,"X",null,null,null,null,"X",null,null,"",800,null,"X","X","X","SINGLE","IB+XB","SUITCASE-DVRS(800) Inband & Crossband; For APX (UHF+700+800) using Single-Band Antenna(s)",4,14,5,0,1345,25,2,"8D093B175",8,null,""]
[null,null,null,null,"X",null,"X",null,null,"","VHF","X","X",null,null,"ALL","IB+XB","SUITCASE-DVRS(VHF) Inband & Crossband; For APX (VHF+UHF) using One All-Band Antenna",1,3,5,1,340,26,2,"8J093B225",10,null,""]
[null,null,null,null,"X",null,"X",null,null,"","VHF","X",null,"X",null,"ALL","IB+XB","SUITCASE-DVRS(VHF) Inband & Crossband; For APX (VHF+700) using One All-Band Antenna",1,5,5,1,374,26,2,"8J093B226",10,null,""]
[null,null,null,null,"X",null,"X",null,null,"","VHF","X","X","X",null,"ALL","IB+XB","SUITCASE-DVRS(VHF) Inband & Crossband; For APX (VHF+UHF+700) using One All-Band Antenna",1,7,5,1,408,26,3,"8J093B234",10,null,""]
[null,null,null,null,"X",null,"X",null,null,"","VHF","X",null,null,"X","ALL","IB+XB","SUITCASE-DVRS(VHF) Inband & Crossband; For APX (VHF+800) using One All-Band Antenna",1,9,5,1,442,26,2,"8J093B226",10,null,""]
[null,null,null,null,"X",null,"X",null,null,"","VHF","X","X",null,"X","ALL","IB+XB","SUITCASE-DVRS(VHF) Inband & Crossband; For APX (VHF+UHF+800) using One All-Band Antenna",1,11,5,1,476,26,3,"8J093B234",10,null,""]
[null,null,null,null,"X",null,"X",null,null,"","VHF","X",null,"X","X","ALL","IB+XB","SUITCASE-DVRS(VHF) Inband & Crossband; For APX (VHF+700+800) using One All-Band Antenna",1,13,5,1,510,26,2,"8J093B226",10,null,""]
[null,null,null,null,"X",null,"X",null,null,"","VHF","X","X","X","X","ALL","IB+XB","SUITCASE-DVRS(VHF) Inband & Crossband; For APX (VHF+UHF+700+800) using One All-Band Antenna",1,15,5,1,544,26,3,"8J093B234",10,null,""]
[null,null,null,null,"X",null,"X",null,null,"","UHF","X","X",null,null,"ALL","IB+XB","SUITCASE-DVRS(UHF) Inband & Crossband; For APX (VHF+UHF) using One All-Band Antenna",2,3,5,1,613,26,2,"8D093B227",10,null,""]
[null,null,null,null,"X",null,"X",null,null,"","UHF",null,"X","X",null,"ALL","IB+XB","SUITCASE-DVRS(UHF) Inband & Crossband; For APX (UHF+700) using One All-Band Antenna",2,6,5,1,664,26,2,"8D093B228",10,null,""]
[null,null,null,null,"X",null,"X",null,null,"","UHF","X","X","X",null,"ALL","IB+XB","SUITCASE-DVRS(UHF) Inband & Crossband; For APX (VHF+UHF+700) using One All-Band Antenna",2,7,5,1,681,26,3,"8D093B235",10,null,""]
[null,null,null,null,"X",null,"X",null,null,"","UHF",null,"X",null,"X","ALL","IB+XB","SUITCASE-DVRS(UHF) Inband & Crossband; For APX (UHF+800) using One All-Band Antenna",2,10,5,1,732,26,2,"8D093B228",10,null,""]
[null,null,null,null,"X",null,"X",null,null,"","UHF","X","X",null,"X","ALL","IB+XB","SUITCASE-DVRS(UHF) Inband & Crossband; For APX (VHF+UHF+800) using One All-Band Antenna",2,11,5,1,749,26,3,"8D093B235",10,null,""]
[null,null,null,null,"X",null,"X",null,null,"","UHF",null,"X","X","X","ALL","IB+XB","SUITCASE-DVRS(UHF) Inband & Crossband; For APX (UHF+700+800) using One All-Band Antenna",2,14,5,1,800,26,2,"8D093B228",10,null,""]
[null,null,null,null,"X",null,"X",null,null,"","UHF","X","X","X","X","ALL","IB+XB","SUITCASE-DVRS(UHF) Inband & Crossband; For APX (VHF+UHF+700+800) using One All-Band Antenna",2,15,5,1,817,26,3,"8D093B235",10,null,""]
[null,null,null,null,"X",null,"X",null,null,"",700,"X",null,"X",null,"ALL","IB+XB","SUITCASE-DVRS(700) Inband & Crossband; For APX (VHF+700) using One All-Band Antenna",3,5,5,1,920,26,2,"8D093B229",10,null,""]
[null,null,null,null,"X",null,"X",null,null,"",700,null,"X","X",null,"ALL","IB+XB","SUITCASE-DVRS(700) Inband & Crossband; For APX (UHF+700) using One All-Band Antenna",3,6,5,1,937,26,2,"8D093B230",10,null,""]
[null,null,null,null,"X",null,"X",null,null,"",700,"X","X","X",null,"ALL","IB+XB","SUITCASE-DVRS(700) Inband & Crossband; For APX (VHF+UHF+700) using One All-Band Antenna",3,7,5,1,954,26,3,"8D093B236",10,null,""]
[null,null,null,null,"X",null,"X",null,null,"",700,"X",null,null,"X","ALL","IB+XB","SUITCASE-DVRS(700) Inband & Crossband; For APX (VHF+800) using One All-Band Antenna",3,9,5,1,988,26,2,"8D093B229",10,null,""]
[null,null,null,null,"X",null,"X",null,null,"",700,null,"X",null,"X","ALL","IB+XB","SUITCASE-DVRS(700) Inband & Crossband; For APX (UHF+800) using One All-Band Antenna",3,10,5,1,1005,26,2,"8D093B230",10,null,""]
[null,null,null,null,"X",null,"X",null,null,"",700,"X","X",null,"X","ALL","IB+XB","SUITCASE-DVRS(700) Inband & Crossband; For APX (VHF+UHF+800) using One All-Band Antenna",3,11,5,1,1022,26,3,"8D093B236",10,null,""]
[null,null,null,null,"X",null,"X",null,null,{"$f":"IF(OR(AND(Y391>2,$P391<>\"All\"),$P391=\"USER\",$Q391=\"XB-Only\"),\"INVALID COMBO\",\"\")","v":""},700,"X",null,"X","X","ALL","IB+XB",{"$f":"$K$6&\"(\"&$K391&\")\"&\" \"&VLOOKUP($Q391,RPTCodes,2,FALSE) &\"; For APX (\"&VLOOKUP($T391,BAND_NAMES,2)&\") using \"&VLOOKUP($P391,ANTcodes,3,FALSE)","v":"SUITCASE-DVRS(700) Inband & Crossband; For APX (VHF+700+800) using One All-Band Antenna"},{"$f":"VLOOKUP(K391,Freq_Bands,2)","v":3},{"$f":"IF(L391=\"X\",1,0)+IF(M391=\"X\",2,0)+IF(N391=\"X\",4,0)+IF(O391=\"X\",8,0)","v":13},{"$f":"VLOOKUP(Q391,RPTCodes,4,FALSE)","v":5},{"$f":"VLOOKUP(P391,ANTcodes,2,FALSE)","v":1},{"$f":"$V391*MULT_ANT+$U391*MULT_RPT+$T391*MULT_MRF+$S391*MULT_VRF","v":1056},{"$f":"IF(LEFT($J391,4)=\"INVA\",$J$4,IF($A391=\"X\",$A$4,0)+IF($B391=\"X\",$B$4,0)+IF($D391=\"X\",$D$4,0)+IF($E391=\"X\",$E$4,0)+IF($F391=\"X\",$F$4,0)+IF($G391=\"X\",$G$4,0)+IF($I391=\"X\",$I$4,0)+IF($C391=\"X\",$C$4,0))","v":26},{"$f":"COUNTA(L391:M391)+IF(RIGHT(N391&O391,1)=\"X\",1,0)","v":2},"8D093B229",10,null,{"$f":"IF(COUNTIF($A391:$H391, \"<>\"&\"\")=0,\"INVALID COMBO\",\"\")","v":""}]
[null,null,null,null,"X",null,"X",null,null,"",700,null,"X","X","X","ALL","IB+XB","SUITCASE-DVRS(700) Inband & Crossband; For APX (UHF+700+800) using One All-Band Antenna",3,14,5,1,1073,26,2,"8D093B230",10,null,""]
[null,null,null,null,"X",null,"X",null,null,"",700,"X","X","X","X","ALL","IB+XB","SUITCASE-DVRS(700) Inband & Crossband; For APX (VHF+UHF+700+800) using One All-Band Antenna",3,15,5,1,1090,26,3,"8D093B236",10,null,""]
[null,null,null,null,"X",null,"X",null,null,"",800,"X",null,"X",null,"ALL","IB+XB","SUITCASE-DVRS(800) Inband & Crossband; For APX (VHF+700) using One All-Band Antenna",4,5,5,1,1193,26,2,"8D093B229",10,null,""]
[null,null,null,null,"X",null,"X",null,null,"",800,null,"X","X",null,"ALL","IB+XB","SUITCASE-DVRS(800) Inband & Crossband; For APX (UHF+700) using One All-Band Antenna",4,6,5,1,1210,26,2,"8D093B230",10,null,""]
[null,null,null,null,"X",null,"X",null,null,"",800,"X","X","X",null,"ALL","IB+XB","SUITCASE-DVRS(800) Inband & Crossband; For APX (VHF+UHF+700) using One All-Band Antenna",4,7,5,1,1227,26,3,"8D093B236",10,null,""]
[null,null,null,null,"X",null,"X",null,null,"",800,"X",null,null,"X","ALL","IB+XB","SUITCASE-DVRS(800) Inband & Crossband; For APX (VHF+800) using One All-Band Antenna",4,9,5,1,1261,26,2,"8D093B229",10,null,""]
[null,null,null,null,"X",null,"X",null,null,"",800,null,"X",null,"X","ALL","IB+XB","SUITCASE-DVRS(800) Inband & Crossband; For APX (UHF+800) using One All-Band Antenna",4,10,5,1,1278,26,2,"8D093B230",10,null,""]
[null,null,null,null,"X",null,"X",null,null,"",800,"X","X",null,"X","ALL","IB+XB","SUITCASE-DVRS(800) Inband & Crossband; For APX (VHF+UHF+800) using One All-Band Antenna",4,11,5,1,1295,26,3,"8D093B236",10,null,""]
[null,null,null,null,"X",null,"X",null,null,"",800,"X",null,"X","X","ALL","IB+XB","SUITCASE-DVRS(800) Inband & Crossband; For APX (VHF+700+800) using One All-Band Antenna",4,13,5,1,1329,26,2,"8D093B229",10,null,""]
[null,null,null,null,"X",null,"X",null,null,"",800,null,"X","X","X","ALL","IB+XB","SUITCASE-DVRS(800) Inband & Crossband; For APX (UHF+700+800) using One All-Band Antenna",4,14,5,1,1346,26,2,"8D093B230",10,null,""]
[null,null,null,null,"X",null,"X",null,null,"",800,"X","X","X","X","ALL","IB+XB","SUITCASE-DVRS(800) Inband & Crossband; For APX (VHF+UHF+700+800) using One All-Band Antenna",4,15,5,1,1363,26,3,"8D093B236",10,null,""]

{"sheet":"Lookups -ORIGINAL","index":7,"n_rows":93,"n_cols":26,"rows_kept":93,"cut":false,"hidden":true,"merged":[]}
[]
["DEVICE","Choice","Data TAB","VR BAND","VRF TX","Choice","REF COL","APX8500 Band","MRF RX","Choice","Code:","REF COL","VR Repeat w/Band","MRF RX","Choice","Code:","RPT mBand","inBand?","xBand?","Repeat Mode","User Description","Use:","Code:","APX ANTENNAS","Choice"]
["DVR",2,"DVR SOLUTIONS","VHF","138-174",1,"H","VHF","136-174",true,1,"I","VHF","136-174",false,1,{"$f":"O3","v":false},{"$f":"AND($O$3,VRFcode=1)","v":false},{"$f":"AND(OR($Q$4,$Q$6),VRFcode=1)","v":true},"IB-Enabled",null,{"$f":"OR($R$3,$R$4,$R$6)","v":false},null,"Unknown",1]
["VRX1000",null,"VRX SOLUTIONS","UHF","380-430",null,"H","UHF","380-470",true,2,"J","UHF","380-470",false,2,{"$f":"OR($O$4:$O$5)","v":false},{"$f":"AND(VRFcode=2,OR($O$4,$O$5))","v":false},{"$f":"AND(VRFcode=2,OR($Q$3,$Q$6))","v":false},"XB-Enabled",null,{"$f":"OR($S$3,$S$4,$S$6)","v":true},null,"1+ SINGLE-BAND"]
["DVR Suitcase",null,"DVR Suitcase","UHF","450-512",null,"H","UHF","450-520",true,2,"J","UHF","450-520",false,2,null,null,null,"IB-Only","Inband/No Crossband",{"$f":"AND($V$3,NOT($V$4))","v":false},1,"1 ALL-BAND"]
[null,null,null,700,"764-776",null,"H",700,"764-776",true,4,"K",700,"764-776",false,4,{"$f":"OR($O$6:$O$8)","v":true},{"$f":"AND(OR(VRFcode=3,VRFcode=4),OR($O$6,$O$7,$O$8))","v":false},{"$f":"AND(OR(VRFcode=3,VRFcode=4),OR($Q$3,$Q$4))","v":false},"IB-Forced","Inband",{"$f":"CHOOSE(VRFcode,MRFcode=1,MRFcode=2,OR(MRFcode=4,MRFcode=8,MRFcode=12),OR(MRFcode=4,MRFcode=8,MRFcode=12))","v":false},2]
[null,null,null,800,"851-869",null,"H",700,"799-806",true,4,"K",700,"799-806",false,4,null,null,null,"XB-Only","Crossband/No Inband",{"$f":"AND(NOT($V$3),$V$4)","v":true},3]
[null,null,null,null,null,null,null,800,"851-870",true,8,"L",800,"851-870",true,8,null,null,null,"XB-Forced","Crossband",{"$f":"CHOOSE($F$12,NOT($J$3),NOT(OR($J$4:$J$5)),NOT(OR($J$6:$J$8)),NOT(OR($J$6:$J$8)))","v":false},4]
[null,null,null,null,null,null,null,null,null,null,null,null,null,null,null,null,null,null,null,"IB+XB","Inband & Crossband",{"$f":"AND($V$3,$V$4)","v":false},5]
[]
[null,"VRcode",null,null,null,"VRFcode",null,null,null,null,"MRFcode",null,null,null,null,"VRRcode",null,null,null,null,null,null,"RPTcode",null,"ANTcode"]
["CODES:",{"$f":"$B$3-1","v":1},null,"<--LOOKUPS-->",null,{"$f":"CHOOSE($F$3,1,2,2,3,4)","v":1},null,null,null,null,{"$f":"$J$3*1+OR($J$4,$J$5)*2+OR($J$6,$J$7)*4+OR($J$8)*8","v":15},null,null,null,null,{"$f":"O3*1+OR(O4,O5)*2+OR(O6,O7)*4+OR(O8)*8","v":8},null,null,null,null,null,null,{"$f":"MAX(IF($V$5:$V$9,$W$5:$W$9,0))","v":3},null,{"$f":"$Y$3-1","v":0}]
["RANGES:->","(0-2)",null,null,null,"(1-4)",null,null,null,null,"(0-15)",null,null,null,null,"(0-15)",null,null,null,null,null,null,"(0-5)",null,"(0-2)"]
["MULTIPLIER:->",null,null,null,null,273,null,null,null,null,17,null,null,null,null,null,null,null,null,null,null,null,3,null,1]
[null,null,null,null,null,"(273-1092)",null,null,null,null,"(0-255)",null,null,null,null,null,null,null,null,null,null,null,"(0-15)",null,"(0-2)"]
["CONFIG CODE=",{"$f":"IF(OR(ErrorMRF,ErrorIBR,ERR_MSUband),\"ERROR\",MAX(0,(VRFcode)*MULT_VRF+(MRFcode)*MULT_MRF+RPTcode*MULT_RPT+ANTcode*MULT_ANT))","v":537},null,null,null,null,null,null,null,"ERROR?",{"$f":"NOT(OR(MsuRxBands))","v":false},null,null,null,"ERROR?",{"$f":"OR(AND(NOT($J$3),$O$3),AND(NOT($J$4),$O$4),AND(NOT($J$5),$O$5),AND(NOT($J$6),$O$6),AND(NOT($J$7),$O$7),AND(NOT($J$8),$O$8))","v":false}]
[null,null,null,null,null,null,null,null,null,null,null,null,null,null,"ERROR?",{"$f":"NOT(OR(AND($J$3,$O$3),AND($J$4,$O$4),AND($J$5,$O$5),AND($J$6,$O$6),AND($J$7,$O$7),AND($J$8,$O$8)))","v":false}]
[null,null,null,null,null,null,null,"FreqBands","VR Band ID","MSU Band ID",null,null,null,"Above ERRORs enable message cells on main tab",null,null,null,null,null,null,null,null,null,"ANTcodes"]
[null,null,null,null,null,null,null,700,3,4,null,null,null,null,null,null,null,null,null,null,null,null,null,"USER",2,"Unknown or User-Defined Antenna"]
[null,null,null,null,null,null,null,800,4,8,null,null,null,null,null,null,null,null,null,null,null,null,null,"SINGLE",0,"Single-Band Antenna(s)"]
[null,null,null,null,null,null,null,"UHF",2,2,null,null,null,null,null,null,null,null,null,null,null,null,null,"ALL",1,"One All-Band Antenna"]
[null,null,null,null,null,null,null,"VHF",1,1]
[]
[null,null,null,null,null,null,null,null,null,null,null,null,"RESULTS FROM LOOKUP"]
[null,"Max Interferer into APX8500 Receiver",null,null,null,null,null,"BAND NAMES","MSU Bands",null,null,"D Index:",{"$f":"MATCH(CONFIG_CODE,'DVR SOLUTIONS'!$V$7:$V$500,0)","v":85},"Line number in DVR Solution table"]
[null,"Level dBm at Mobile Port",null,null,null,null,null,0,"none",null,null,"V Index:",{"$f":"MATCH(CONFIG_CODE,'VRX SOLUTIONS'!$V$7:$V$500,0)","v":131},"Line number in VRX Solution table"]
[null,"APX8500 BAND Rx",null,null,null,null,null,1,"VHF",null,null,"DS Index",{"$f":"MATCH(CONFIG_CODE,'DVR Suitcase'!$W$7:$W$500,0)","v":56},"Line number in DVR Suitcase Solution table"]
["VR BAND TX","VHF","UHF",700,800,null,null,2,"UHF",null,null,"Description",{"$f":"CHOOSE(VRcode+1,INDEX('DVR SOLUTIONS'!$Q$7:$Q$500,'Lookups -ORIGINAL'!$M$25),INDEX('VRX SOLUTIONS'!$Q$7:$Q$500,'Lookups -ORIGINAL'!$M$26),INDEX('DVR Suitcase'!$R$7:$R$500,'Lookups -ORIGINAL'!$M$27))","v":"VRX1000 (VHF) Crossband/No Inband; For APX (VHF+UHF+700+800) using Single-Band Antenna(s)"}]
["VHF","X",-2.9,-0.6,3,null,null,3,"VHF+UHF",null,null,"Filtering ",{"$f":"CHOOSE(VRcode+1,INDEX('DVR SOLUTIONS'!$W$7:$W$500,'Lookups -ORIGINAL'!$M$25),INDEX('VRX SOLUTIONS'!$W$7:$W$500,'Lookups -ORIGINAL'!$M$26),INDEX('DVR Suitcase'!$X$7:$X$500,'Lookups -ORIGINAL'!$M$27))","v":12},"=FILTER_Code"]
["UHF",3,"X",4.4000000000000004,0.5,null,null,4,700,null,null,"Filtering ",{"$f":"VLOOKUP($M$29,AntennaFilters,15)","v":"Triplexer and Relay (Separate Kits)"}]
[700,3.4,-1.6,"X","X",null,null,5,"VHF+700",null,null,"NOTES 1",{"$f":"VLOOKUP($U$32,tblNOTES,2)","v":"Without  Triplexer,  at Least 44 dB VR-to-APX Antenna Isolation Required Instead!"},null,null,null,null,null,null,null,"Note-Index","tblNOTES"]
[800,2.6,1.3,"X","X",null,null,6,"UHF+700",null,null,"NOTES 2",{"$f":"VLOOKUP($U$32,tblNOTES,2)","v":"Without  Triplexer,  at Least 44 dB VR-to-APX Antenna Isolation Required Instead!"},null,null,null,null,null,null,null,{"$f":"VLOOKUP(FILTER_Code,AntennaFilters,(VRcode+2))","v":2},1,"This Filtering is Mandatory"]
[null,null,null,null,null,null,null,7,"VHF+UHF+700",null,null,"Drawing",{"$f":"CHOOSE(VRcode+1,INDEX('DVR SOLUTIONS'!$Y$7:$Y$500,'Lookups -ORIGINAL'!$M$25),INDEX('VRX SOLUTIONS'!$Y$7:$Y$500,'Lookups -ORIGINAL'!$M$26),INDEX('DVR Suitcase'!$Z$7:$Z$500,'Lookups -ORIGINAL'!$M$27))","v":"8J087X51-58"},null,null,null,null,null,null,null,null,2,{"$f":"\"Without  Triplexer,  at Least \"&$T$56&\" dB VR-to-APX Antenna Isolation Required Instead!\"","v":"Without  Triplexer,  at Least 44 dB VR-to-APX Antenna Isolation Required Instead!"}]
[null,"Above as-measured, used to determine isolation required",null,null,null,null,null,8,800,null,null,null,"ABOVE is what is displayed to User",null,null,null,null,null,null,null,null,3,{"$f":"\"CROSS-BAND operation REQUIRES At Least \"&$T$56&\" dB VR-to-APX Antenna Isolation!\"","v":"CROSS-BAND operation REQUIRES At Least 44 dB VR-to-APX Antenna Isolation!"}]
[null,null,null,null,null,null,null,9,"VHF+800",null,null,null,null,null,null,null,null,null,null,null,null,4,{"$f":"\"IN-BAND Filtering Required; CROSS-BAND operation REQUIRES At Least \"&$T$56&\" dB VR-to-APX Antenna Isolation!\"","v":"IN-BAND Filtering Required; CROSS-BAND operation REQUIRES At Least 44 dB VR-to-APX Antenna Isolation!"}]
[null,null,null,null,null,null,null,10,"UHF+800",null,null,null,null,null,null,null,null,null,null,null,null,5,"INVALID Selections"]
[null,"TX POWER (dBm)",null,"ISOLATION  ","MARGIN (dB)",null,null,11,"VHF+UHF+800",null,null,"Reformatted VR->MSU Interferer Levels",null,null,null,null,null,null,null,"VALID:",null,6,"N/A"]
["DVR",37.799999999999997,null,null,6,null,null,12,"700+800",null,null,"VR Tx Band","Used?","MSU Rx Band","Used?","Interferer","Margin","TxPwr","Isol Req","Isol.",null,7,"Two Kits are Required"]
["VRX",34.799999999999997,null,null,null,null,null,13,"VHF+700+800",null,null,"VHF",{"$f":"(VRFcode=1)","v":true},"VHF",{"$f":"$J$3","v":true},{"$f":"B29","v":"X"},{"$f":"$E$38","v":6},{"$f":"CHOOSE(VRcode+1,$B$38,$B$39,$B$38)","v":34.799999999999997},{"$f":"R39+Q39-P39","v":{"$error":"#VALUE!"}},{"$f":"IF(AND(M39,O39), \"Inband\",\"\")","v":"Inband"},null,8,"Filter Bypass Relay Kit is Optionally Available "]
[null,null,null,null,null,null,null,14,"UHF+700+800",null,null,"VHF",true,"UHF",{"$f":"OR($J$4,$J$5)","v":true},{"$f":"C29","v":-2.9},6,34.799999999999997,{"$f":"R40+Q40-P40","v":43.699999999999996},{"$f":"IF(AND(M40,O40), S40,\"\")","v":43.699999999999996},null,9,"NEW SUITCASE MESSAGE 9 (TBD)"]
[null,null,null,null,null,null,null,15,"VHF+UHF+700+800",null,null,"VHF",true,700,{"$f":"OR($J$6,$J$7)","v":true},{"$f":"D29","v":-0.6},6,34.799999999999997,41.4,{"$f":"IF(AND(M41,O41), S41,\"\")","v":41.4},null,10,"MUST Contact Futurecom-CUSTOM ENGINEERING QUOTE REQUIRED"]
[null,null,null,null,null,null,null,null,null,null,null,"VHF",true,800,{"$f":"$J$8","v":true},{"$f":"E29","v":3},6,34.799999999999997,37.799999999999997,37.799999999999997]
[null,null,null,null,null,null,null,null,null,null,null,"UHF",{"$f":"(VRFcode=2)","v":false},"VHF",{"$f":"$J$3","v":true},{"$f":"B30","v":3},6,34.799999999999997,37.799999999999997,""]
[null,null,null,null,null,null,null,null,null,null,null,"UHF",false,"UHF",{"$f":"OR($J$4,$J$5)","v":true},{"$f":"C30","v":"X"},6,34.799999999999997,{"$error":"#VALUE!"},{"$f":"IF(AND(M44,O44), \"Inband\",\"\")","v":""}]
[null,null,null,null,null,null,null,null,null,null,null,"UHF",false,700,{"$f":"OR($J$6,$J$7)","v":true},{"$f":"D30","v":4.4000000000000004},6,34.799999999999997,36.4,""]
[null,null,null,null,null,null,null,null,null,null,null,"UHF",false,800,{"$f":"$J$8","v":true},{"$f":"E30","v":0.5},6,34.799999999999997,40.299999999999997,""]
[null,null,null,null,null,null,null,null,null,null,null,700,{"$f":"(VRFcode=3)","v":false},"VHF",{"$f":"$J$3","v":true},{"$f":"B31","v":3.4},6,34.799999999999997,37.4,""]
[null,null,null,null,null,null,null,null,null,null,null,700,false,"UHF",{"$f":"OR($J$4,$J$5)","v":true},{"$f":"C31","v":-1.6},6,34.799999999999997,42.4,""]
[null,null,null,null,null,null,null,null,null,null,null,700,false,700,{"$f":"OR($J$6,$J$7)","v":true},{"$f":"D31","v":"X"},6,34.799999999999997,{"$error":"#VALUE!"},{"$f":"IF(AND(M49,O49), \"Inband\",\"\")","v":""}]
[null,null,null,null,null,null,null,null,null,null,null,700,false,800,{"$f":"$J$8","v":true},{"$f":"E31","v":"X"},6,34.799999999999997,{"$error":"#VALUE!"},{"$f":"IF(AND(M50,O50), \"Inband\",\"\")","v":""}]
[null,null,null,null,null,null,null,null,null,null,null,800,{"$f":"(VRFcode=4)","v":false},"VHF",{"$f":"$J$3","v":true},{"$f":"B32","v":2.6},6,34.799999999999997,38.199999999999996,{"$f":"IF(AND(M51,O51), S51,\"\")","v":""}]
[null,null,null,null,null,null,null,null,null,null,null,800,false,"UHF",{"$f":"OR($J$4,$J$5)","v":true},{"$f":"C32","v":1.3},6,34.799999999999997,39.5,{"$f":"IF(AND(M52,O52), S52,\"\")","v":""}]
[null,null,null,null,null,null,null,null,null,null,null,800,false,700,{"$f":"OR($J$6,$J$7)","v":true},{"$f":"D32","v":"X"},6,34.799999999999997,{"$error":"#VALUE!"},{"$f":"IF(AND(M53,O53), \"Inband\",\"\")","v":""}]
[null,null,null,null,null,null,null,null,null,null,null,800,false,800,{"$f":"$J$8","v":true},{"$f":"E32","v":"X"},6,34.799999999999997,{"$error":"#VALUE!"},{"$f":"IF(AND(M54,O54), \"Inband\",\"\")","v":""}]
[]
[null,null,null,null,"PACKAGE QTY TO ORDER (Displayed in table on MAIN)",null,null,null,null,null,null,null,null,null,null,null,null,null,"MIN ISOL:",{"$f":"ROUND(MAX(T39:T54),0)","v":44}]
["TABLE: ANTENNAFILTERS",null,null,null,"KIT #:"]
[null,"Added NOTE to Display:",null,null,"-",1,null,2,3,4,5,6,7]
[" FILTER TYPES","DVR","VRX","DVR-Case","I/B","TRI",null,"TRI+Relay","2xTRI","2xTRI+Relay","RELAY+Encl","TRI (SC)","2xTRI (SC)","SPECIAL !","Description"]
[0,5,5,5,0,0,null,0,0,0,0,0,0,0,"INVALID COMBINATION"]
[1,null,null,null,0,0,null,0,0,0,0,0,0,0,"NONE required"]
[2,2,2,null,0,1,null,0,0,0,0,0,0,0,"Antenna TRIPLEXER"]
[3,2,2,null,0,0,null,1,0,0,0,0,0,0,"Antenna TRIPLEXER & RELAY"]
[4,2,2,null,0,0,null,0,1,0,0,0,0,0,"Dual TRIPLEXER"]
[5,2,2,null,0,0,null,0,0,1,0,0,0,0,"Dual TRIPLEXER & RELAY"]
[6,1,null,1,1,0,null,0,0,0,0,0,0,0,"STANDARD IN-BAND FILTER PACKAGE"]
[7,1,null,1,1,0,null,0,0,0,0,0,0,0,"STANDARD IN-BAND FILTER PACKAGE"]
[8,1,null,null,1,1,null,0,0,0,0,0,0,0,"IN-BAND FILTER PACKAGE & APX Antenna TRIPLEXER"]
[9,null,null,null,1,0,null,1,0,0,0,0,0,0,"IN-BAND FILTER PACKAGE & APX Antenna TRIPLEXER & RELAY"]
[10,2,null,null,1,0,null,0,1,0,0,0,0,0,"IN-BAND FILTER PACKAGE & APX Antenna DUAL TRIPLEXER"]
[11,null,null,null,1,0,null,0,0,1,0,0,0,0,"IN-BAND FILTER PACKAGE & APX Antenna DUAL TRIPLEXER & RELAY"]
[12,2,2,null,0,1,null,0,0,0,1,0,0,0,"Triplexer and Relay (Separate Kits)"]
[13,null,6,null,1,0,null,0,0,0,0,0,0,0,"STANDARD IN-BAND FILTER PACKAGE"]
[14,null,6,null,1,1,null,0,0,0,0,0,0,0,"IN-BAND FILTER PACKAGE & APX Antenna TRIPLEXER"]
[15,null,null,null,1,0,null,0,1,0,0,0,0,0,"IN-BAND FILTER PACKAGE & APX Antenna DUAL TRIPLEXER"]
[16,null,6,null,1,0,null,0,1,0,0,0,0,0,"IN-BAND FILTER PACKAGE & APX Antenna DUAL TRIPLEXER"]
[17,null,null,null,0,1,null,0,0,0,0,0,0,0,"Antenna TRIPLEXER for Multiple APX Antennas"]
[18,null,null,null,0,0,null,0,0,0,0,0,0,1,"CANNOT ORDER - Special Quote Required"]
[19,null,null,2,0,0,null,0,0,0,0,1,0,0,"Single TRIPLEXER (Suitcase)"]
[20,null,null,2,0,0,null,0,0,0,0,0,1,0,"Dual TRIPLEXER (Suitcase)"]
[23,null,null,2,0,0,null,0,0,0,0,1,0,0,"Single TRIPLEXER for Multiple APX Antennas (Suitcase)"]
[25,null,null,2,1,0,null,0,0,0,0,1,0,0,"IN-BAND FILTER PACKAGE & APX Antenna TRIPLEXER (Suitcase)"]
[26,null,null,2,1,0,null,0,0,0,0,0,1,0,"IN-BAND FILTER PACKAGE & APX Antenna DUAL TRIPLEXER (Suitcase)"]
[]
[]
[]
[null,null,null,null,"See Order Guide","In-Band Filtering Package"]
[null,null,null,null,"QA09450AA","Antenna Triplexer (Required for APX Radio using multiple antennas)"]
[null,null,null,null,"DDN2656A","Antenna Triplexer (Alternate to QA09450AA)"]
[null,null,null,null,"QA09449AA","Triplexer with Enclosure"]
[null,null,null,null,"DDN2657A","Dual Triplexers in Enclosure"]
[null,null,null,null,"QA09445AA","Dual Triplexers with Bypass Relay in Enclosure"]
[null,null,null,null,"QA09446AA","Filter Bypass Relay in Enclosure"]

{"sheet":"Lookups","index":8,"n_rows":93,"n_cols":26,"rows_kept":93,"cut":false,"hidden":true,"merged":[]}
[]
["DEVICE","Choice","Data TAB","VR BAND","VRF TX","Choice","REF COL","APX8500 Band","MRF RX","Choice","Code:","REF COL","VR Repeat w/Band","MRF RX","Choice","Code:","RPT mBand","inBand?","xBand?","Repeat Mode","User Description","Use:","Code:","APX ANTENNAS","Choice"]
["DVR",2,"DVR SOLUTIONS","VHF","138-174",1,"H","VHF","136-174",true,1,"I","VHF","136-174",true,1,{"$f":"O3","v":true},{"$f":"AND($O$3,VRFcode=1)","v":true},{"$f":"AND(OR($Q$4,$Q$6),VRFcode=1)","v":true},"IB-Enabled",null,{"$f":"OR($R$3,$R$4,$R$6)","v":true},null,"Unknown",1]
["VRX1000",null,"VRX SOLUTIONS","UHF","380-430",null,"H","UHF","380-470",true,2,"J","UHF","380-470",true,2,{"$f":"OR($O$4:$O$5)","v":true},{"$f":"AND(VRFcode=2,OR($O$4,$O$5))","v":false},{"$f":"AND(VRFcode=2,OR($Q$3,$Q$6))","v":false},"XB-Enabled",null,{"$f":"OR($S$3,$S$4,$S$6)","v":true},null,"1+ SINGLE-BAND"]
["DVR Suitcase",null,"DVR Suitcase","UHF","450-512",null,"H","UHF","450-520",true,2,"J","UHF","450-520",true,2,null,null,null,"IB-Only","Inband/No Crossband",{"$f":"AND($V$3,NOT($V$4))","v":false},1,"1 ALL-BAND"]
[null,null,null,700,"764-776",null,"H",700,"764-776",true,4,"K",700,"764-776",true,4,{"$f":"OR($O$6:$O$8)","v":true},{"$f":"AND(OR(VRFcode=3,VRFcode=4),OR($O$6,$O$7,$O$8))","v":false},{"$f":"AND(OR(VRFcode=3,VRFcode=4),OR($Q$3,$Q$4))","v":false},"IB-Forced","Inband",{"$f":"CHOOSE(VRFcode,MRFcode=1,MRFcode=2,OR(MRFcode=4,MRFcode=8,MRFcode=12),OR(MRFcode=4,MRFcode=8,MRFcode=12))","v":false},2]
[null,null,null,800,"851-869",null,"H",700,"799-806",true,4,"K",700,"799-806",true,4,null,null,null,"XB-Only","Crossband/No Inband",{"$f":"AND(NOT($V$3),$V$4)","v":false},3]
[null,null,null,null,null,null,null,800,"851-870",true,8,"L",800,"851-870",true,8,null,null,null,"XB-Forced","Crossband",{"$f":"CHOOSE($F$12,NOT($J$3),NOT(OR($J$4:$J$5)),NOT(OR($J$6:$J$8)),NOT(OR($J$6:$J$8)))","v":false},4]
[null,null,null,null,null,null,null,null,null,null,null,null,null,null,null,null,null,null,null,"IB+XB","Inband & Crossband",{"$f":"AND($V$3,$V$4)","v":true},5]
[]
[null,"VRcode",null,null,null,"VRFcode",null,null,null,null,"MRFcode",null,null,null,null,"VRRcode",null,null,null,null,null,null,"RPTcode",null,"ANTcode"]
["CODES:",{"$f":"$B$3-1","v":1},null,"<--LOOKUPS-->",null,{"$f":"CHOOSE($F$3,1,2,2,3,4)","v":1},null,null,null,null,{"$f":"$J$3*1+OR($J$4,$J$5)*2+OR($J$6,$J$7)*4+OR($J$8)*8","v":15},null,null,null,null,{"$f":"O3*1+OR(O4,O5)*2+OR(O6,O7)*4+OR(O8)*8","v":15},null,null,null,null,null,null,{"$f":"MAX(IF($V$5:$V$9,$W$5:$W$9,0))","v":5},null,{"$f":"$Y$3-1","v":0}]
["RANGES:->","(0-2)",null,null,null,"(1-4)",null,null,null,null,"(0-15)",null,null,null,null,"(0-15)",null,null,null,null,null,null,"(0-5)",null,"(0-2)"]
["MULTIPLIER:->",null,null,null,null,273,null,null,null,null,17,null,null,null,null,null,null,null,null,null,null,null,3,null,1]
[null,null,null,null,null,"(273-1092)",null,null,null,null,"(0-255)",null,null,null,null,null,null,null,null,null,null,null,"(0-15)",null,"(0-2)"]
["CONFIG CODE=",{"$f":"IF(OR(ErrorMRF,ErrorIBR,ERR_MSUband),\"ERROR\",MAX(0,(VRFcode)*MULT_VRF+(MRFcode)*MULT_MRF+RPTcode*MULT_RPT+ANTcode*MULT_ANT))","v":543},null,null,null,null,null,null,null,"ERROR?",{"$f":"NOT(OR(MsuRxBands))","v":false},null,null,null,"ERROR?",{"$f":"OR(AND(NOT($J$3),$O$3),AND(NOT($J$4),$O$4),AND(NOT($J$5),$O$5),AND(NOT($J$6),$O$6),AND(NOT($J$7),$O$7),AND(NOT($J$8),$O$8))","v":false}]
[null,null,null,null,null,null,null,null,null,null,null,null,null,null,"ERROR?",{"$f":"NOT(OR(AND($J$3,$O$3),AND($J$4,$O$4),AND($J$5,$O$5),AND($J$6,$O$6),AND($J$7,$O$7),AND($J$8,$O$8)))","v":false}]
[null,null,null,null,null,null,null,"FreqBands","VR Band ID","MSU Band ID",null,null,null,"Above ERRORs enable message cells on main tab",null,null,null,null,null,null,null,null,null,"ANTcodes"]
[null,null,null,null,null,null,null,700,3,4,null,null,null,null,null,null,null,null,null,null,null,null,null,"USER",2,"Unknown or User-Defined Antenna"]
[null,null,null,null,null,null,null,800,4,8,null,null,null,null,null,null,null,null,null,null,null,null,null,"SINGLE",0,"Single-Band Antenna(s)"]
[null,null,null,null,null,null,null,"UHF",2,2,null,null,null,null,null,null,null,null,null,null,null,null,null,"ALL",1,"One All-Band Antenna"]
[null,null,null,null,null,null,null,"VHF",1,1]
[]
[null,null,null,null,null,null,null,null,null,null,null,null,"RESULTS FROM LOOKUP"]
[null,"Max Interferer into APX8500 Receiver",null,null,null,null,null,"BAND NAMES","MSU Bands",null,null,"D Index:",{"$f":"MATCH(CONFIG_CODE,'DVR SOLUTIONS'!$V$7:$V$500,0)","v":88},"Line number in DVR Solution table"]
[null,"Level dBm at Mobile Port",null,null,null,null,null,0,"none",null,null,"V Index:",{"$f":"MATCH(CONFIG_CODE,'VRX SOLUTIONS'!$V$7:$V$500,0)","v":287},"Line number in VRX Solution table"]
[null,"APX8500 BAND Rx",null,null,null,null,null,1,"VHF",null,null,"DS Index",{"$f":"MATCH(CONFIG_CODE,'DVR Suitcase'!$W$7:$W$500,0)","v":59},"Line number in DVR Suitcase Solution table"]
["VR BAND TX","VHF","UHF",700,800,null,null,2,"UHF",null,null,"Description",{"$f":"CHOOSE(VRcode+1,INDEX('DVR SOLUTIONS'!$Q$7:$Q$500,Lookups!$M$25),INDEX('VRX SOLUTIONS'!$Q$7:$Q$500,Lookups!$M$26),INDEX('DVR Suitcase'!$R$7:$R$500,Lookups!$M$27))","v":"VRX1000 (VHF) Inband & Crossband; For APX (VHF+UHF+700+800) using Single-Band Antenna(s)"}]
["VHF","X",-2.9,-0.6,3,null,null,3,"VHF+UHF",null,null,"Filtering ",{"$f":"CHOOSE(VRcode+1,INDEX('DVR SOLUTIONS'!$W$7:$W$500,Lookups!$M$25),INDEX('VRX SOLUTIONS'!$W$7:$W$500,Lookups!$M$26),INDEX('DVR Suitcase'!$X$7:$X$500,Lookups!$M$27))","v":14},"=FILTER_Code"]
["UHF",3,"X",4.4000000000000004,0.5,null,null,4,700,null,null,"Filtering ",{"$f":"VLOOKUP($M$29,AntennaFilters,15)","v":"IN-BAND FILTER PACKAGE & APX Antenna TRIPLEXER"}]
[700,3.4,-1.6,"X","X",null,null,5,"VHF+700",null,null,"NOTES 1",{"$f":"VLOOKUP($U$32,tblNOTES,2)","v":"N/A"},null,null,null,null,null,null,null,"Note-Index","tblNOTES"]
[800,2.6,1.3,"X","X",null,null,6,"UHF+700",null,null,"NOTES 2",{"$f":"VLOOKUP($U$32,tblNOTES,2)","v":"N/A"},null,null,null,null,null,null,null,{"$f":"VLOOKUP(FILTER_Code,AntennaFilters,(VRcode+2))","v":6},1,"This Filtering is Mandatory"]
[null,null,null,null,null,null,null,7,"VHF+UHF+700",null,null,"Drawing",{"$f":"CHOOSE(VRcode+1,INDEX('DVR SOLUTIONS'!$Y$7:$Y$500,Lookups!$M$25),INDEX('VRX SOLUTIONS'!$Y$7:$Y$500,Lookups!$M$26),INDEX('DVR Suitcase'!$Z$7:$Z$500,Lookups!$M$27))","v":"No Drawing"},null,null,null,null,null,null,null,null,2,{"$f":"\"Without  Triplexer,  at Least \"&$T$56&\" dB VR-to-APX Antenna Isolation Required Instead!\"","v":"Without  Triplexer,  at Least 44 dB VR-to-APX Antenna Isolation Required Instead!"}]
[null,"Above as-measured, used to determine isolation required",null,null,null,null,null,8,800,null,null,null,"ABOVE is what is displayed to User",null,null,null,null,null,null,null,null,3,{"$f":"\"CROSS-BAND operation REQUIRES At Least \"&$T$56&\" dB VR-to-APX Antenna Isolation!\"","v":"CROSS-BAND operation REQUIRES At Least 44 dB VR-to-APX Antenna Isolation!"}]
[null,null,null,null,null,null,null,9,"VHF+800",null,null,null,null,null,null,null,null,null,null,null,null,4,{"$f":"\"IN-BAND Filtering Required; CROSS-BAND operation REQUIRES At Least \"&$T$56&\" dB VR-to-APX Antenna Isolation!\"","v":"IN-BAND Filtering Required; CROSS-BAND operation REQUIRES At Least 44 dB VR-to-APX Antenna Isolation!"}]
[null,null,null,null,null,null,null,10,"UHF+800",null,null,null,null,null,null,null,null,null,null,null,null,5,"INVALID Selections"]
[null,"TX POWER (dBm)",null,"ISOLATION  ","MARGIN (dB)",null,null,11,"VHF+UHF+800",null,null,"Reformatted VR->MSU Interferer Levels",null,null,null,null,null,null,null,"VALID:",null,6,"N/A"]
["DVR",37.799999999999997,null,null,6,null,null,12,"700+800",null,null,"VR Tx Band","Used?","MSU Rx Band","Used?","Interferer","Margin","TxPwr","Isol Req","Isol.",null,7,"Two Kits are Required"]
["VRX",34.799999999999997,null,null,null,null,null,13,"VHF+700+800",null,null,"VHF",{"$f":"(VRFcode=1)","v":true},"VHF",{"$f":"$J$3","v":true},{"$f":"B29","v":"X"},{"$f":"$E$38","v":6},{"$f":"CHOOSE(VRcode+1,$B$38,$B$39,$B$38)","v":34.799999999999997},{"$f":"R39+Q39-P39","v":{"$error":"#VALUE!"}},{"$f":"IF(AND(M39,O39), \"Inband\",\"\")","v":"Inband"},null,8,"Filter Bypass Relay Kit is Optionally Available "]
[null,null,null,null,null,null,null,14,"UHF+700+800",null,null,"VHF",true,"UHF",{"$f":"OR($J$4,$J$5)","v":true},{"$f":"C29","v":-2.9},6,34.799999999999997,{"$f":"R40+Q40-P40","v":43.699999999999996},{"$f":"IF(AND(M40,O40), S40,\"\")","v":43.699999999999996},null,9,"NEW SUITCASE MESSAGE 9 (TBD)"]
[null,null,null,null,null,null,null,15,"VHF+UHF+700+800",null,null,"VHF",true,700,{"$f":"OR($J$6,$J$7)","v":true},{"$f":"D29","v":-0.6},6,34.799999999999997,41.4,{"$f":"IF(AND(M41,O41), S41,\"\")","v":41.4},null,10,"MUST Contact Futurecom-CUSTOM ENGINEERING QUOTE REQUIRED"]
[null,null,null,null,null,null,null,null,null,null,null,"VHF",true,800,{"$f":"$J$8","v":true},{"$f":"E29","v":3},6,34.799999999999997,37.799999999999997,37.799999999999997]
[null,null,null,null,null,null,null,null,null,null,null,"UHF",{"$f":"(VRFcode=2)","v":false},"VHF",{"$f":"$J$3","v":true},{"$f":"B30","v":3},6,34.799999999999997,37.799999999999997,""]
[null,null,null,null,null,null,null,null,null,null,null,"UHF",false,"UHF",{"$f":"OR($J$4,$J$5)","v":true},{"$f":"C30","v":"X"},6,34.799999999999997,{"$error":"#VALUE!"},{"$f":"IF(AND(M44,O44), \"Inband\",\"\")","v":""}]
[null,null,null,null,null,null,null,null,null,null,null,"UHF",false,700,{"$f":"OR($J$6,$J$7)","v":true},{"$f":"D30","v":4.4000000000000004},6,34.799999999999997,36.4,""]
[null,null,null,null,null,null,null,null,null,null,null,"UHF",false,800,{"$f":"$J$8","v":true},{"$f":"E30","v":0.5},6,34.799999999999997,40.299999999999997,""]
[null,null,null,null,null,null,null,null,null,null,null,700,{"$f":"(VRFcode=3)","v":false},"VHF",{"$f":"$J$3","v":true},{"$f":"B31","v":3.4},6,34.799999999999997,37.4,""]
[null,null,null,null,null,null,null,null,null,null,null,700,false,"UHF",{"$f":"OR($J$4,$J$5)","v":true},{"$f":"C31","v":-1.6},6,34.799999999999997,42.4,""]
[null,null,null,null,null,null,null,null,null,null,null,700,false,700,{"$f":"OR($J$6,$J$7)","v":true},{"$f":"D31","v":"X"},6,34.799999999999997,{"$error":"#VALUE!"},{"$f":"IF(AND(M49,O49), \"Inband\",\"\")","v":""}]
[null,null,null,null,null,null,null,null,null,null,null,700,false,800,{"$f":"$J$8","v":true},{"$f":"E31","v":"X"},6,34.799999999999997,{"$error":"#VALUE!"},{"$f":"IF(AND(M50,O50), \"Inband\",\"\")","v":""}]
[null,null,null,null,null,null,null,null,null,null,null,800,{"$f":"(VRFcode=4)","v":false},"VHF",{"$f":"$J$3","v":true},{"$f":"B32","v":2.6},6,34.799999999999997,38.199999999999996,{"$f":"IF(AND(M51,O51), S51,\"\")","v":""}]
[null,null,null,null,null,null,null,null,null,null,null,800,false,"UHF",{"$f":"OR($J$4,$J$5)","v":true},{"$f":"C32","v":1.3},6,34.799999999999997,39.5,{"$f":"IF(AND(M52,O52), S52,\"\")","v":""}]
[null,null,null,null,null,null,null,null,null,null,null,800,false,700,{"$f":"OR($J$6,$J$7)","v":true},{"$f":"D32","v":"X"},6,34.799999999999997,{"$error":"#VALUE!"},{"$f":"IF(AND(M53,O53), \"Inband\",\"\")","v":""}]
[null,null,null,null,null,null,null,null,null,null,null,800,false,800,{"$f":"$J$8","v":true},{"$f":"E32","v":"X"},6,34.799999999999997,{"$error":"#VALUE!"},{"$f":"IF(AND(M54,O54), \"Inband\",\"\")","v":""}]
[]
[null,null,null,null,"PACKAGE QTY TO ORDER (Displayed in table on MAIN)",null,null,null,null,null,null,null,null,null,null,null,null,null,"MIN ISOL:",{"$f":"ROUND(MAX(T39:T54),0)","v":44}]
["TABLE: ANTENNAFILTERS",null,null,null,"KIT #:"]
[null,"Added NOTE to Display:",null,null,"-",1,null,2,3,4,5,6,7]
[" FILTER TYPES","DVR","VRX","DVR-Case","I/B","TRI",null,"TRI+Relay","2xTRI","2xTRI+Relay","RELAY+Encl","TRI (SC)","2xTRI (SC)","SPECIAL !","Description"]
[0,5,5,5,0,0,null,0,0,0,0,0,0,0,"INVALID COMBINATION"]
[1,null,null,null,0,0,null,0,0,0,0,0,0,0,"NONE required"]
[2,2,2,null,0,1,null,0,0,0,0,0,0,0,"Antenna TRIPLEXER"]
[3,2,2,null,0,0,null,1,0,0,0,0,0,0,"Antenna TRIPLEXER & RELAY"]
[4,2,2,null,0,0,null,0,1,0,0,0,0,0,"Dual TRIPLEXER"]
[5,2,2,null,0,0,null,0,0,1,0,0,0,0,"Dual TRIPLEXER & RELAY"]
[6,1,null,1,1,0,null,0,0,0,0,0,0,0,"STANDARD IN-BAND FILTER PACKAGE"]
[7,1,null,1,1,0,null,0,0,0,0,0,0,0,"STANDARD IN-BAND FILTER PACKAGE"]
[8,1,null,null,1,1,null,0,0,0,0,0,0,0,"IN-BAND FILTER PACKAGE & APX Antenna TRIPLEXER"]
[9,null,null,null,1,0,null,1,0,0,0,0,0,0,"IN-BAND FILTER PACKAGE & APX Antenna TRIPLEXER & RELAY"]
[10,2,null,null,1,0,null,0,1,0,0,0,0,0,"IN-BAND FILTER PACKAGE & APX Antenna DUAL TRIPLEXER"]
[11,null,null,null,1,0,null,0,0,1,0,0,0,0,"IN-BAND FILTER PACKAGE & APX Antenna DUAL TRIPLEXER & RELAY"]
[12,2,2,null,0,1,null,0,0,0,1,0,0,0,"Triplexer and Relay (Separate Kits)"]
[13,null,6,null,1,0,null,0,0,0,0,0,0,0,"STANDARD IN-BAND FILTER PACKAGE"]
[14,null,6,null,1,1,null,0,0,0,0,0,0,0,"IN-BAND FILTER PACKAGE & APX Antenna TRIPLEXER"]
[15,null,null,null,1,0,null,0,1,0,0,0,0,0,"IN-BAND FILTER PACKAGE & APX Antenna DUAL TRIPLEXER"]
[16,null,6,null,1,0,null,0,1,0,0,0,0,0,"IN-BAND FILTER PACKAGE & APX Antenna DUAL TRIPLEXER"]
[17,null,null,null,0,1,null,0,0,0,0,0,0,0,"Antenna TRIPLEXER for Multiple APX Antennas"]
[18,null,null,null,0,0,null,0,0,0,0,0,0,1,"CANNOT ORDER - Special Quote Required"]
[19,null,null,2,0,0,null,0,0,0,0,1,0,0,"Single TRIPLEXER (Suitcase)"]
[20,null,null,2,0,0,null,0,0,0,0,0,1,0,"Dual TRIPLEXER (Suitcase)"]
[23,null,null,2,0,0,null,0,0,0,0,1,0,0,"Single TRIPLEXER for Multiple APX Antennas (Suitcase)"]
[25,null,null,2,1,0,null,0,0,0,0,1,0,0,"IN-BAND FILTER PACKAGE & APX Antenna TRIPLEXER (Suitcase)"]
[26,null,null,2,1,0,null,0,0,0,0,0,1,0,"IN-BAND FILTER PACKAGE & APX Antenna DUAL TRIPLEXER (Suitcase)"]
[]
[]
[]
[null,null,null,null,"See Order Guide","In-Band Filtering Package"]
[null,null,null,null,"QA09450AA","Antenna Triplexer (Required for APX Radio using multiple antennas)"]
[null,null,null,null,"DDN2656A","Antenna Triplexer (Alternate to QA09450AA)"]
[null,null,null,null,"QA09449AA","Triplexer with Enclosure"]
[null,null,null,null,"DDN2657A","Dual Triplexers in Enclosure"]
[null,null,null,null,"QA09445AA","Dual Triplexers with Bypass Relay in Enclosure"]
[null,null,null,null,"QA09446AA","Filter Bypass Relay in Enclosure"]