{"text_format":"1","workbook":"xlsx","n_sheets":9,"sheets":["MAIN","VRX SOLUTIONS","MAIN -ORIGINAL","VRX SOLUTIONS- MAP","DVR SOLUTIONS- MAP","DVR SOLUTIONS","DVR Suitcase","Lookups -ORIGINAL","Lookups"],"not_rendered":{"charts":0,"images":1,"macros":1,"external_links":1,"defined_names":68,"comments":2,"pivot_tables":0},"unopened":[],"bounds":{"document_bytes":16777216,"sheet_cells":100000,"rows_first":2000,"rows_last":500,"rows_between":2000,"halvings":0,"cell_chars":16384,"cell_head_chars":4096},"cells_cut":0,"cells_raw":0,"read":"whole","date_system":"1900"}

{"sheet":"MAIN","index":0,"n_rows":44,"n_cols":12,"rows_kept":44,"cut":false,"hidden":false,"merged":[[42,2,42,3],[28,4,29,12],[24,4,25,12]]}
[null,null,null,null,"SELECT ALL CHOICES BELOW FOR THE PROPOSED SYSTEM "]
[null,null,null,null,"RESULT IS LISTED AT BOTTOM"]
[]
[]
[]
[]
[]
[]
[]
[]
[]
[null,"APX 8500 Frequency Band Information",null,null,null,{"$f":"IF(Lookups!$K$16,\"ERROR: Please Check BANDS used by APX\",\"\")","v":""}]
[null,null,null,null,null,{"$f":"IF(Lookups!$P$17,\"ERROR: Please Check APX BAND where VR will be Used\",\"\")","v":""}]
[null,null,null,null,null,{"$f":"IF(Lookups!$P$16,\"ERROR: A Band chosen for APX-VR Repeat is not an APX Band\",\"\")","v":""}]
[]
{"$rows_left_out":30}
{"sheet":"VRX SOLUTIONS","index":1,"n_rows":378,"n_cols":25,"rows_kept":378,"cut":false,"hidden":true,"merged":[[2,6,2,7]]}
[null,null,null,null,null,null,null,null,"VRX FILTERING CONFIGURATOR"]
["SOLUTIONS REQUIRED"]
[null,"Kit-1","Kit-2","Kit-3","KIT-4","KIT-0","Kit-5",null,"VRX",null,null,null,null,null,null,null,null,"Lookup/Sorting Codes",null,null,null,null,"FilterCode"]
[1,2,3,4,5,6,6,10,null,"VRX","MSU FREQUENCY BANDS USED",null,null,null,"MSU "]
[null,"TRIPLEXER SOLUTION",null,null,null,"STANDARD","OPTION","Required","NOTES","BAND","b1","b2","b3a","b3b","ANT","REPEAT",null,4,16,4,2]
["NONE","1x","1x+Relay","2x","2x+Relay","In-BAND","Relay","Relay","NOTES","VRX1000 ","VHF","UHF",700,800,"MSU-Ant","TYPE","DESCRIPTION","VRF","MRF","RPT","ANT","TOTAl","FL","NumBands","Drawing"]
[null,"X",null,null,null,null,null,null,null,"VHF",null,"X",null,null,"SINGLE","XB-Forced",{"$f":"$J$6&\"(\"&$J7&\")\"&\" \"&VLOOKUP($P7,RPTCodes,2,FALSE) &\"; For APX (\"&VLOOKUP($S7,BAND_NAMES,2)&\") using \"&VLOOKUP($O7,ANTcodes,3,FALSE)","v":"VRX1000 (VHF) Crossband; For APX (UHF) using Single-Band Antenna(s)"},{"$f":"VLOOKUP(J7,Freq_Bands,2)","v":1},{"$f":"IF(K7=\"X\",1,0)+IF(L7=\"X\",2,0)+IF(M7=\"X\",4,0)+IF(N7=\"X\",8,0)","v":2},{"$f":"VLOOKUP(P7,RPTCodes,4,FALSE)","v":4},{"$f":"VLOOKUP(O7,ANTcodes,2,FALSE)","v":0},{"$f":"$U7*MULT_ANT+$T7*MULT_RPT+$S7*MULT_MRF+$R7*MULT_VRF","v":319},{"$f":"IF($A7=\"X\",1,0)+IF($B7=\"X\",2,0)+IF($C7=\"X\",3,0)+IF($D7=\"X\",4,0)+IF($E7=\"X\",5,0)+IF($F7=\"X\",6,0)+IF($H7=\"X\",10,0)+IF($G7=\"X\",6,0)","v":2},{"$f":"COUNTA(K7:L7)+IF(RIGHT(M7&N7,1)=\"X\",1,0)","v":1},"No Drawing"]
[null,"X",null,null,null,null,null,null,null,"VHF",null,"X",null,null,"ALL","XB-Forced","VRX1000 (VHF) Crossband; For APX (UHF) using One All-Band Antenna",1,2,4,1,320,2,1,"No Drawing"]
[null,"X",null,null,null,null,null,null,null,"VHF",null,"X",null,null,"USER","XB-Forced","VRX1000 (VHF) Crossband; For APX (UHF) using Unknown or User-Defined Antenna",1,2,4,2,321,2,1,"No Drawing"]
[null,"X",null,null,null,null,null,null,null,"VHF",null,null,"X",null,"SINGLE","XB-Forced","VRX1000 (VHF) Crossband; For APX (700) using Single-Band Antenna(s)",1,4,4,0,353,2,1,"No Drawing"]
[null,"X",null,null,null,null,null,null,null,"VHF",null,null,"X",null,"ALL","XB-Forced","VRX1000 (VHF) Crossband; For APX (700) using One All-Band Antenna",1,4,4,1,354,2,1,"No Drawing"]
[null,"X",null,null,null,null,null,null,null,"VHF",null,null,"X",null,"USER","XB-Forced","VRX1000 (VHF) Crossband; For APX (700) using Unknown or User-Defined Antenna",1,4,4,2,355,2,1,"No Drawing"]
[null,"X",null,null,null,null,null,null,null,"VHF",null,"X","X",null,"SINGLE","XB-Forced","VRX1000 (VHF) Crossband; For APX (UHF+700) using Single-Band Antenna(s)",1,6,4,0,387,2,2,"No Drawing"]
[null,"X",null,null,null,null,null,null,null,"VHF",null,null,null,"X","SINGLE","XB-Forced","VRX1000 (VHF) Crossband; For APX (800) using Single-Band Antenna(s)",1,8,4,0,421,2,1,"No Drawing"]
[null,"X",null,null,null,null,null,null,null,"VHF",null,null,null,"X","ALL","XB-Forced","VRX1000 (VHF) Crossband; For APX (800) using One All-Band Antenna",1,8,4,1,422,2,1,"No Drawing"]
{"$rows_left_out":364}
{"sheet":"MAIN -ORIGINAL","index":2,"n_rows":44,"n_cols":12,"rows_kept":44,"cut":false,"hidden":true,"merged":[[24,4,25,12],[28,4,29,12],[42,2,42,3]]}
[null,null,null,null,"SELECT ALL CHOICES BELOW FOR THE PROPOSED SYSTEM "]
[null,null,null,null,"RESULT IS LISTED AT BOTTOM"]
[]
[]
[]
[]
[]
[]
[]
[]
[]
[null,"APX 8500 Frequency Band Information",null,null,null,{"$f":"IF(Lookups!$K$16,\"ERROR: Please Check BANDS used by APX\",\"\")","v":""}]
[null,null,null,null,null,{"$f":"IF(Lookups!$P$17,\"ERROR: Please Check APX BAND where VR will be Used\",\"\")","v":""}]
[null,null,null,null,null,{"$f":"IF(Lookups!$P$16,\"ERROR: A Band chosen for APX-VR Repeat is not an APX Band\",\"\")","v":""}]
[]
{"$rows_left_out":30}
{"sheet":"VRX SOLUTIONS- MAP","index":3,"n_rows":378,"n_cols":25,"rows_kept":378,"cut":false,"hidden":true,"merged":[[2,6,2,7]]}
[null,null,null,null,null,null,null,null,"VRX FILTERING CONFIGURATOR"]
["SOLUTIONS REQUIRED"]
[null,"Kit-1","Kit-2","Kit-3","KIT-4","KIT-0","Kit-5",null,"VRX",null,null,null,null,null,null,null,null,"Lookup/Sorting Codes",null,null,null,null,"FilterCode"]
[1,2,3,4,5,6,6,10,null,"VRX","MSU FREQUENCY BANDS USED",null,null,null,"MSU "]
[null,"TRIPLEXER SOLUTION",null,null,null,"STANDARD","OPTION","Required","NOTES","BAND","b1","b2","b3a","b3b","ANT","REPEAT",null,4,16,4,2]
["NONE","1x","1x+Relay","2x","2x+Relay","In-BAND","Relay","Relay","NOTES","VRX1000 ","VHF","UHF",700,800,"MSU-Ant","TYPE","DESCRIPTION","VRF","MRF","RPT","ANT","TOTAl","FL","NumBands","Drawing"]
[null,"X",null,null,null,null,null,null,null,"VHF",null,"X",null,null,"SINGLE","XB-Forced",{"$f":"$J$6&\"(\"&$J7&\")\"&\" \"&VLOOKUP($P7,RPTCodes,2,FALSE) &\"; For APX (\"&VLOOKUP($S7,BAND_NAMES,2)&\") using \"&VLOOKUP($O7,ANTcodes,3,FALSE)","v":"VRX1000 (VHF) Crossband; For APX (UHF) using Single-Band Antenna(s)"},{"$f":"VLOOKUP(J7,Freq_Bands,2)","v":1},{"$f":"IF(K7=\"X\",1,0)+IF(L7=\"X\",2,0)+IF(M7=\"X\",4,0)+IF(N7=\"X\",8,0)","v":2},{"$f":"VLOOKUP(P7,RPTCodes,4,FALSE)","v":4},{"$f":"VLOOKUP(O7,ANTcodes,2,FALSE)","v":0},{"$f":"$U7*MULT_ANT+$T7*MULT_RPT+$S7*MULT_MRF+$R7*MULT_VRF","v":319},{"$f":"IF($A7=\"X\",1,0)+IF($B7=\"X\",2,0)+IF($C7=\"X\",3,0)+IF($D7=\"X\",4,0)+IF($E7=\"X\",5,0)+IF($F7=\"X\",6,0)+IF($H7=\"X\",10,0)+IF($G7=\"X\",6,0)","v":2},{"$f":"COUNTA(K7:L7)+IF(RIGHT(M7&N7,1)=\"X\",1,0)","v":1},"No Drawing"]
[null,"X",null,null,null,null,null,null,null,"VHF",null,"X",null,null,"ALL","XB-Forced","VRX1000 (VHF) Crossband; For APX (UHF) using One All-Band Antenna",1,2,4,1,320,2,1,"No Drawing"]
[null,"X",null,null,null,null,null,null,null,"VHF",null,"X",null,null,"USER","XB-Forced","VRX1000 (VHF) Crossband; For APX (UHF) using Unknown or User-Defined Antenna",1,2,4,2,321,2,1,"No Drawing"]
[null,"X",null,null,null,null,null,null,null,"VHF",null,null,"X",null,"SINGLE","XB-Forced","VRX1000 (VHF) Crossband; For APX (700) using Single-Band Antenna(s)",1,4,4,0,353,2,1,"No Drawing"]
[null,"X",null,null,null,null,null,null,null,"VHF",null,null,"X",null,"ALL","XB-Forced","VRX1000 (VHF) Crossband; For APX (700) using One All-Band Antenna",1,4,4,1,354,2,1,"No Drawing"]
[null,"X",null,null,null,null,null,null,null,"VHF",null,null,"X",null,"USER","XB-Forced","VRX1000 (VHF) Crossband; For APX (700) using Unknown or User-Defined Antenna",1,4,4,2,355,2,1,"No Drawing"]
[null,"X",null,null,null,null,null,null,null,"VHF",null,"X","X",null,"SINGLE","XB-Forced","VRX1000 (VHF) Crossband; For APX (UHF+700) using Single-Band Antenna(s)",1,6,4,0,387,2,2,"No Drawing"]
[null,"X",null,null,null,null,null,null,null,"VHF",null,null,null,"X","SINGLE","XB-Forced","VRX1000 (VHF) Crossband; For APX (800) using Single-Band Antenna(s)",1,8,4,0,421,2,1,"No Drawing"]
[null,"X",null,null,null,null,null,null,null,"VHF",null,null,null,"X","ALL","XB-Forced","VRX1000 (VHF) Crossband; For APX (800) using One All-Band Antenna",1,8,4,1,422,2,1,"No Drawing"]
{"$rows_left_out":364}
{"sheet":"DVR SOLUTIONS- MAP","index":4,"n_rows":402,"n_cols":26,"rows_kept":402,"cut":false,"hidden":true,"merged":[[2,6,2,7]]}
[null,null,null,null,null,null,null,null,"DVR FILTERING CONFIGURATOR"]
["SOLUTIONS REQUIRED"]
[null,"Kit-1","Kit-2","Kit-3","KIT-4","KIT-0","Kit-5",null,"DVR",null,null,null,null,null,null,null,null,"Lookup/Sorting Codes",null,null,null,null,"FilterCode"]
[1,2,3,4,5,6," ",10,null,"DVR","MSU FREQUENCY BANDS USED",null,null,null,"MSU "]
[null,"TRIPLEXER SOLUTION",null,null,null,"STANDARD","OPTION","Required","NOTES","BAND","b1","b2","b3a","b3b","ANT","REPEAT",null,4,16,4,2]
["NONE","1x","1x+Relay","2x","2x+Relay","In-BAND","Relay","Relay","NOTES","DVR ","VHF","UHF",700,800,"MSU-Ant","TYPE","DESCRIPTION","VRF","MRF","RPT","ANT","TOTAl","FL","NumBands","Drawing"]
["X",null,null,null,null,"X",null,null,null,"VHF","X",null,null,null,"SINGLE","IB-Forced",{"$f":"$J$6&\"(\"&$J7&\")\"&\" \"&VLOOKUP($P7,RPTCodes,2,FALSE) &\"; For APX (\"&VLOOKUP($S7,BAND_NAMES,2)&\") using \"&VLOOKUP($O7,ANTcodes,3,FALSE)","v":"DVR (VHF) Inband; For APX (VHF) using Single-Band Antenna(s)"},{"$f":"VLOOKUP(J7,Freq_Bands,2)","v":1},{"$f":"IF(K7=\"X\",1,0)+IF(L7=\"X\",2,0)+IF(M7=\"X\",4,0)+IF(N7=\"X\",8,0)","v":1},{"$f":"VLOOKUP(P7,RPTCodes,4,FALSE)","v":2},{"$f":"VLOOKUP(O7,ANTcodes,2,FALSE)","v":0},{"$f":"$U7*MULT_ANT+$T7*MULT_RPT+$S7*MULT_MRF+$R7*MULT_VRF","v":296},{"$f":"IF($A7=\"X\",1,0)+IF($B7=\"X\",2,0)+IF($C7=\"X\",3,0)+IF($D7=\"X\",4,0)+IF($E7=\"X\",5,0)+IF($F7=\"X\",6,0)+IF($H7=\"X\",10,0)","v":7},{"$f":"COUNTA(K7:L7)+IF(RIGHT(M7&N7,1)=\"X\",1,0)","v":1},"No Drawing",{"$f":"IF(COUNTIF($A7:$H7, \"<>\"&\"\")=0,\"INVALID COMBO\",\"\")","v":""}]
["X",null,null,null,null,"X",null,null,null,"VHF","X",null,null,null,"ALL","IB-Forced","DVR (VHF) Inband; For APX (VHF) using One All-Band Antenna",1,1,2,1,297,7,1,"No Drawing",""]
["X",null,null,null,null,"X",null,null,null,"VHF","X",null,null,null,"USER","IB-Forced","DVR (VHF) Inband; For APX (VHF) using Unknown or User-Defined Antenna",1,1,2,2,298,7,1,"No Drawing",""]
[null,null,null,null,null,null,null,null,"INVALID COMBO","VHF","X",null,null,null,"SINGLE","XB-Only","DVR (VHF) Crossband/No Inband; For APX (VHF) using Single-Band Antenna(s)",1,1,3,0,299,0,1,"No Drawing","INVALID COMBO"]
[null,null,null,null,null,null,null,null,"INVALID COMBO","VHF","X",null,null,null,"ALL","XB-Only","DVR (VHF) Crossband/No Inband; For APX (VHF) using One All-Band Antenna",1,1,3,1,300,0,1,"No Drawing","INVALID COMBO"]
[null,null,null,null,null,null,null,null,"INVALID COMBO","VHF","X",null,null,null,"USER","XB-Only","DVR (VHF) Crossband/No Inband; For APX (VHF) using Unknown or User-Defined Antenna",1,1,3,2,301,0,1,"No Drawing","INVALID COMBO"]
[null,"X",null,null,null,null,null,null,null,"VHF",null,"X",null,null,"SINGLE","XB-Forced","DVR (VHF) Crossband; For APX (UHF) using Single-Band Antenna(s)",1,2,4,0,319,2,1,"No Drawing",""]
[null,"X",null,null,null,null,null,null,null,"VHF",null,"X",null,null,"ALL","XB-Forced","DVR (VHF) Crossband; For APX (UHF) using One All-Band Antenna",1,2,4,1,320,2,1,"No Drawing",""]
[null,"X",null,null,null,null,null,null,null,"VHF",null,"X",null,null,"USER","XB-Forced","DVR (VHF) Crossband; For APX (UHF) using Unknown or User-Defined Antenna",1,2,4,2,321,2,1,"No Drawing",""]
{"$rows_left_out":388}
{"sheet":"DVR SOLUTIONS","index":5,"n_rows":402,"n_cols":26,"rows_kept":402,"cut":false,"hidden":true,"merged":[[2,6,2,7]]}
[null,null,null,null,null,null,null,null,"DVR FILTERING CONFIGURATOR"]
["SOLUTIONS REQUIRED"]
[null,"Kit-1","Kit-2","Kit-3","KIT-4","KIT-0","Kit-5",null,"DVR",null,null,null,null,null,null,null,null,"Lookup/Sorting Codes",null,null,null,null,"FilterCode"]
[1,2,3,4,5,6," ",10,null,"DVR","MSU FREQUENCY BANDS USED",null,null,null,"MSU "]
[null,"TRIPLEXER SOLUTION",null,null,null,"STANDARD","OPTION","Required","NOTES","BAND","b1","b2","b3a","b3b","ANT","REPEAT",null,4,16,4,2]
["NONE","1x","1x+Relay","2x","2x+Relay","In-BAND","Relay","Relay","NOTES","DVR ","VHF","UHF",700,800,"MSU-Ant","TYPE","DESCRIPTION","VRF","MRF","RPT","ANT","TOTAl","FL","NumBands","Drawing"]
["X",null,null,null,null,"X",null,null,null,"VHF","X",null,null,null,"SINGLE","IB-Forced",{"$f":"$J$6&\"(\"&$J7&\")\"&\" \"&VLOOKUP($P7,RPTCodes,2,FALSE) &\"; For APX (\"&VLOOKUP($S7,BAND_NAMES,2)&\") using \"&VLOOKUP($O7,ANTcodes,3,FALSE)","v":"DVR (VHF) Inband; For APX (VHF) using Single-Band Antenna(s)"},{"$f":"VLOOKUP(J7,Freq_Bands,2)","v":1},{"$f":"IF(K7=\"X\",1,0)+IF(L7=\"X\",2,0)+IF(M7=\"X\",4,0)+IF(N7=\"X\",8,0)","v":1},{"$f":"VLOOKUP(P7,RPTCodes,4,FALSE)","v":2},{"$f":"VLOOKUP(O7,ANTcodes,2,FALSE)","v":0},{"$f":"$U7*MULT_ANT+$T7*MULT_RPT+$S7*MULT_MRF+$R7*MULT_VRF","v":296},{"$f":"IF($A7=\"X\",1,0)+IF($B7=\"X\",2,0)+IF($C7=\"X\",3,0)+IF($D7=\"X\",4,0)+IF($E7=\"X\",5,0)+IF($F7=\"X\",6,0)+IF($H7=\"X\",10,0)","v":7},{"$f":"COUNTA(K7:L7)+IF(RIGHT(M7&N7,1)=\"X\",1,0)","v":1},"No Drawing",{"$f":"IF(COUNTIF($A7:$H7, \"<>\"&\"\")=0,\"INVALID COMBO\",\"\")","v":""}]
["X",null,null,null,null,"X",null,null,null,"VHF","X",null,null,null,"ALL","IB-Forced","DVR (VHF) Inband; For APX (VHF) using One All-Band Antenna",1,1,2,1,297,7,1,"No Drawing",""]
["X",null,null,null,null,"X",null,null,null,"VHF","X",null,null,null,"USER","IB-Forced","DVR (VHF) Inband; For APX (VHF) using Unknown or User-Defined Antenna",1,1,2,2,298,7,1,"No Drawing",""]
[null,null,null,null,null,null,null,null,"INVALID COMBO","VHF","X",null,null,null,"SINGLE","XB-Only","DVR (VHF) Crossband/No Inband; For APX (VHF) using Single-Band Antenna(s)",1,1,3,0,299,0,1,"No Drawing","INVALID COMBO"]
[null,null,null,null,null,null,null,null,"INVALID COMBO","VHF","X",null,null,null,"ALL","XB-Only","DVR (VHF) Crossband/No Inband; For APX (VHF) using One All-Band Antenna",1,1,3,1,300,0,1,"No Drawing","INVALID COMBO"]
[null,null,null,null,null,null,null,null,"INVALID COMBO","VHF","X",null,null,null,"USER","XB-Only","DVR (VHF) Crossband/No Inband; For APX (VHF) using Unknown or User-Defined Antenna",1,1,3,2,301,0,1,"No Drawing","INVALID COMBO"]
[null,"X",null,null,null,null,null,null,null,"VHF",null,"X",null,null,"SINGLE","XB-Forced","DVR (VHF) Crossband; For APX (UHF) using Single-Band Antenna(s)",1,2,4,0,319,2,1,"No Drawing",""]
[null,"X",null,null,null,null,null,null,null,"VHF",null,"X",null,null,"ALL","XB-Forced","DVR (VHF) Crossband; For APX (UHF) using One All-Band Antenna",1,2,4,1,320,2,1,"No Drawing",""]
[null,"X",null,null,null,null,null,null,null,"VHF",null,"X",null,null,"USER","XB-Forced","DVR (VHF) Crossband; For APX (UHF) using Unknown or User-Defined Antenna",1,2,4,2,321,2,1,"No Drawing",""]
{"$rows_left_out":388}
{"sheet":"DVR Suitcase","index":6,"n_rows":402,"n_cols":30,"rows_kept":402,"cut":false,"hidden":true,"merged":[[2,7,2,8]]}
[null,null,null,null,null,null,null,null,null,"DVRS-SUITCASE FILTERING CONFIGURATOR",null,null,null,null,null,null,"Note: Suitcase Internal triplexing is NOT possible. RF SWITCH can ONLY be used with IN-BAND Filtering"]
["SOLUTIONS REQUIRED"]
[null,"Kit-6","XB-1","Kit-2","Kit-7","KIT-4","KIT-0","Kit-5",null,"DVR",null,null,null,null,null,null,null,null,"Lookup/Sorting Codes",null,null,null,null,"FilterCode"]
[1,19,23,3,20,5,6," ",10,0,"DVR","MSU FREQUENCY BANDS USED",null,null,null,"MSU "]
[null,"TRIPLEXER SOLUTION",null,null,null,null,"STANDARD","OPTION","Required","NOTES","BAND","b1","b2","b3a","b3b","ANT","REPEAT",null,4,16,4,2]
["NONE","1x (SC)","1XB","1x+Relay","2x (SC)","2x+Relay","In-BAND","Relay","Relay","NOTES","SUITCASE-DVRS","VHF","UHF",700,800,"MSU-Ant","TYPE","DESCRIPTION","VRF","MRF","RPT","ANT","TOTAl","FL","NumBands","Drawing","OLD FL","Other Notes"]
["X",null,null,null,null,null,"X",null,null,{"$f":"IF(OR(AND(Y7>2,$P7<>\"All\"),$P7=\"USER\",$Q7=\"XB-Only\"),\"INVALID COMBO\",\"\")","v":"INVALID COMBO"},"VHF","X",null,null,null,"USER","IB-Forced",{"$f":"$K$6&\"(\"&$K7&\")\"&\" \"&VLOOKUP($Q7,RPTCodes,2,FALSE) &\"; For APX (\"&VLOOKUP($T7,BAND_NAMES,2)&\") using \"&VLOOKUP($P7,ANTcodes,3,FALSE)","v":"SUITCASE-DVRS(VHF) Inband; For APX (VHF) using Unknown or User-Defined Antenna"},{"$f":"VLOOKUP(K7,Freq_Bands,2)","v":1},{"$f":"IF(L7=\"X\",1,0)+IF(M7=\"X\",2,0)+IF(N7=\"X\",4,0)+IF(O7=\"X\",8,0)","v":1},{"$f":"VLOOKUP(Q7,RPTCodes,4,FALSE)","v":2},{"$f":"VLOOKUP(P7,ANTcodes,2,FALSE)","v":2},{"$f":"$V7*MULT_ANT+$U7*MULT_RPT+$T7*MULT_MRF+$S7*MULT_VRF","v":298},{"$f":"IF(LEFT($J7,4)=\"INVA\",$J$4,IF($A7=\"X\",$A$4,0)+IF($B7=\"X\",$B$4,0)+IF($D7=\"X\",$D$4,0)+IF($E7=\"X\",$E$4,0)+IF($F7=\"X\",$F$4,0)+IF($G7=\"X\",$G$4,0)+IF($I7=\"X\",$I$4,0)+IF($C7=\"X\",$C$4,0))","v":0},{"$f":"COUNTA(L7:M7)+IF(RIGHT(N7&O7,1)=\"X\",1,0)","v":1},"No Drawing",7,"Single MSU Band",{"$f":"IF(COUNTIF($A7:$H7, \"<>\"&\"\")=0,\"INVALID COMBO\",\"\")","v":""}]
[null,null,null,null,null,null,null,null,null,"INVALID COMBO","VHF","X",null,null,null,"SINGLE","XB-Only","SUITCASE-DVRS(VHF) Crossband/No Inband; For APX (VHF) using Single-Band Antenna(s)",1,1,3,0,299,0,1,"No Drawing",0,"Illogical terminology","INVALID COMBO","INVALID COMBO"]
[null,null,null,null,null,null,null,null,null,"INVALID COMBO","VHF","X",null,null,null,"ALL","XB-Only","SUITCASE-DVRS(VHF) Crossband/No Inband; For APX (VHF) using One All-Band Antenna",1,1,3,1,300,0,1,"No Drawing",0,"Illogical terminology","INVALID COMBO","INVALID COMBO"]
[null,null,null,null,null,null,null,null,null,"INVALID COMBO","VHF","X",null,null,null,"USER","XB-Only","SUITCASE-DVRS(VHF) Crossband/No Inband; For APX (VHF) using Unknown or User-Defined Antenna",1,1,3,2,301,0,1,"No Drawing",0,"Illogical terminology","INVALID COMBO","INVALID COMBO"]
[null,"X",null,null,null,null,null,null,null,"","VHF",null,"X",null,null,"SINGLE","XB-Forced","SUITCASE-DVRS(VHF) Crossband; For APX (UHF) using Single-Band Antenna(s)",1,2,4,0,319,19,1,"No Drawing",2,"Single MSU Band",""]
[null,"X",null,null,null,null,null,null,null,"","VHF",null,"X",null,null,"ALL","XB-Forced","SUITCASE-DVRS(VHF) Crossband; For APX (UHF) using One All-Band Antenna",1,2,4,1,320,19,1,"No Drawing",2,"Single MSU Band",""]
[null,"X",null,null,null,null,null,null,null,"INVALID COMBO","VHF",null,"X",null,null,"USER","XB-Forced","SUITCASE-DVRS(VHF) Crossband; For APX (UHF) using Unknown or User-Defined Antenna",1,2,4,2,321,0,1,"No Drawing",2,null,""]
[null,null,null,null,null,null,"X",null,null,"INVALID COMBO","VHF","X","X",null,null,"USER","IB-Only","SUITCASE-DVRS(VHF) Inband/No Crossband; For APX (VHF+UHF) using Unknown or User-Defined Antenna",1,3,1,2,329,0,2,"No Drawing",6,null,""]
[null,"X",null,null,null,null,null,null,"X","INVALID COMBO","VHF","X","X",null,null,"SINGLE","XB-Only","SUITCASE-DVRS(VHF) Crossband/No Inband; For APX (VHF+UHF) using Single-Band Antenna(s)",1,3,3,0,333,0,2,"No Drawing",18,"Original Special Order","","Special Order"]
{"$rows_left_out":388}
{"sheet":"Lookups -ORIGINAL","index":7,"n_rows":93,"n_cols":26,"rows_kept":93,"cut":false,"hidden":true,"merged":[]}
[]
["DEVICE","Choice","Data TAB","VR BAND","VRF TX","Choice","REF COL","APX8500 Band","MRF RX","Choice","Code:","REF COL","VR Repeat w/Band","MRF RX","Choice","Code:","RPT mBand","inBand?","xBand?","Repeat Mode","User Description","Use:","Code:","APX ANTENNAS","Choice"]
["DVR",2,"DVR SOLUTIONS","VHF","138-174",1,"H","VHF","136-174",true,1,"I","VHF","136-174",false,1,{"$f":"O3","v":false},{"$f":"AND($O$3,VRFcode=1)","v":false},{"$f":"AND(OR($Q$4,$Q$6),VRFcode=1)","v":true},"IB-Enabled",null,{"$f":"OR($R$3,$R$4,$R$6)","v":false},null,"Unknown",1]
["VRX1000",null,"VRX SOLUTIONS","UHF","380-430",null,"H","UHF","380-470",true,2,"J","UHF","380-470",false,2,{"$f":"OR($O$4:$O$5)","v":false},{"$f":"AND(VRFcode=2,OR($O$4,$O$5))","v":false},{"$f":"AND(VRFcode=2,OR($Q$3,$Q$6))","v":false},"XB-Enabled",null,{"$f":"OR($S$3,$S$4,$S$6)","v":true},null,"1+ SINGLE-BAND"]
["DVR Suitcase",null,"DVR Suitcase","UHF","450-512",null,"H","UHF","450-520",true,2,"J","UHF","450-520",false,2,null,null,null,"IB-Only","Inband/No Crossband",{"$f":"AND($V$3,NOT($V$4))","v":false},1,"1 ALL-BAND"]
[null,null,null,700,"764-776",null,"H",700,"764-776",true,4,"K",700,"764-776",false,4,{"$f":"OR($O$6:$O$8)","v":true},{"$f":"AND(OR(VRFcode=3,VRFcode=4),OR($O$6,$O$7,$O$8))","v":false},{"$f":"AND(OR(VRFcode=3,VRFcode=4),OR($Q$3,$Q$4))","v":false},"IB-Forced","Inband",{"$f":"CHOOSE(VRFcode,MRFcode=1,MRFcode=2,OR(MRFcode=4,MRFcode=8,MRFcode=12),OR(MRFcode=4,MRFcode=8,MRFcode=12))","v":false},2]
[null,null,null,800,"851-869",null,"H",700,"799-806",true,4,"K",700,"799-806",false,4,null,null,null,"XB-Only","Crossband/No Inband",{"$f":"AND(NOT($V$3),$V$4)","v":true},3]
[null,null,null,null,null,null,null,800,"851-870",true,8,"L",800,"851-870",true,8,null,null,null,"XB-Forced","Crossband",{"$f":"CHOOSE($F$12,NOT($J$3),NOT(OR($J$4:$J$5)),NOT(OR($J$6:$J$8)),NOT(OR($J$6:$J$8)))","v":false},4]
[null,null,null,null,null,null,null,null,null,null,null,null,null,null,null,null,null,null,null,"IB+XB","Inband & Crossband",{"$f":"AND($V$3,$V$4)","v":false},5]
[]
[null,"VRcode",null,null,null,"VRFcode",null,null,null,null,"MRFcode",null,null,null,null,"VRRcode",null,null,null,null,null,null,"RPTcode",null,"ANTcode"]
["CODES:",{"$f":"$B$3-1","v":1},null,"<--LOOKUPS-->",null,{"$f":"CHOOSE($F$3,1,2,2,3,4)","v":1},null,null,null,null,{"$f":"$J$3*1+OR($J$4,$J$5)*2+OR($J$6,$J$7)*4+OR($J$8)*8","v":15},null,null,null,null,{"$f":"O3*1+OR(O4,O5)*2+OR(O6,O7)*4+OR(O8)*8","v":8},null,null,null,null,null,null,{"$f":"MAX(IF($V$5:$V$9,$W$5:$W$9,0))","v":3},null,{"$f":"$Y$3-1","v":0}]
["RANGES:->","(0-2)",null,null,null,"(1-4)",null,null,null,null,"(0-15)",null,null,null,null,"(0-15)",null,null,null,null,null,null,"(0-5)",null,"(0-2)"]
["MULTIPLIER:->",null,null,null,null,273,null,null,null,null,17,null,null,null,null,null,null,null,null,null,null,null,3,null,1]
[null,null,null,null,null,"(273-1092)",null,null,null,null,"(0-255)",null,null,null,null,null,null,null,null,null,null,null,"(0-15)",null,"(0-2)"]
{"$rows_left_out":79}
{"sheet":"Lookups","index":8,"n_rows":93,"n_cols":26,"rows_kept":93,"cut":false,"hidden":true,"merged":[]}
[]
["DEVICE","Choice","Data TAB","VR BAND","VRF TX","Choice","REF COL","APX8500 Band","MRF RX","Choice","Code:","REF COL","VR Repeat w/Band","MRF RX","Choice","Code:","RPT mBand","inBand?","xBand?","Repeat Mode","User Description","Use:","Code:","APX ANTENNAS","Choice"]
["DVR",2,"DVR SOLUTIONS","VHF","138-174",1,"H","VHF","136-174",true,1,"I","VHF","136-174",true,1,{"$f":"O3","v":true},{"$f":"AND($O$3,VRFcode=1)","v":true},{"$f":"AND(OR($Q$4,$Q$6),VRFcode=1)","v":true},"IB-Enabled",null,{"$f":"OR($R$3,$R$4,$R$6)","v":true},null,"Unknown",1]
["VRX1000",null,"VRX SOLUTIONS","UHF","380-430",null,"H","UHF","380-470",true,2,"J","UHF","380-470",true,2,{"$f":"OR($O$4:$O$5)","v":true},{"$f":"AND(VRFcode=2,OR($O$4,$O$5))","v":false},{"$f":"AND(VRFcode=2,OR($Q$3,$Q$6))","v":false},"XB-Enabled",null,{"$f":"OR($S$3,$S$4,$S$6)","v":true},null,"1+ SINGLE-BAND"]
["DVR Suitcase",null,"DVR Suitcase","UHF","450-512",null,"H","UHF","450-520",true,2,"J","UHF","450-520",true,2,null,null,null,"IB-Only","Inband/No Crossband",{"$f":"AND($V$3,NOT($V$4))","v":false},1,"1 ALL-BAND"]
[null,null,null,700,"764-776",null,"H",700,"764-776",true,4,"K",700,"764-776",true,4,{"$f":"OR($O$6:$O$8)","v":true},{"$f":"AND(OR(VRFcode=3,VRFcode=4),OR($O$6,$O$7,$O$8))","v":false},{"$f":"AND(OR(VRFcode=3,VRFcode=4),OR($Q$3,$Q$4))","v":false},"IB-Forced","Inband",{"$f":"CHOOSE(VRFcode,MRFcode=1,MRFcode=2,OR(MRFcode=4,MRFcode=8,MRFcode=12),OR(MRFcode=4,MRFcode=8,MRFcode=12))","v":false},2]
[null,null,null,800,"851-869",null,"H",700,"799-806",true,4,"K",700,"799-806",true,4,null,null,null,"XB-Only","Crossband/No Inband",{"$f":"AND(NOT($V$3),$V$4)","v":false},3]
[null,null,null,null,null,null,null,800,"851-870",true,8,"L",800,"851-870",true,8,null,null,null,"XB-Forced","Crossband",{"$f":"CHOOSE($F$12,NOT($J$3),NOT(OR($J$4:$J$5)),NOT(OR($J$6:$J$8)),NOT(OR($J$6:$J$8)))","v":false},4]
[null,null,null,null,null,null,null,null,null,null,null,null,null,null,null,null,null,null,null,"IB+XB","Inband & Crossband",{"$f":"AND($V$3,$V$4)","v":true},5]
[]
[null,"VRcode",null,null,null,"VRFcode",null,null,null,null,"MRFcode",null,null,null,null,"VRRcode",null,null,null,null,null,null,"RPTcode",null,"ANTcode"]
["CODES:",{"$f":"$B$3-1","v":1},null,"<--LOOKUPS-->",null,{"$f":"CHOOSE($F$3,1,2,2,3,4)","v":1},null,null,null,null,{"$f":"$J$3*1+OR($J$4,$J$5)*2+OR($J$6,$J$7)*4+OR($J$8)*8","v":15},null,null,null,null,{"$f":"O3*1+OR(O4,O5)*2+OR(O6,O7)*4+OR(O8)*8","v":15},null,null,null,null,null,null,{"$f":"MAX(IF($V$5:$V$9,$W$5:$W$9,0))","v":5},null,{"$f":"$Y$3-1","v":0}]
["RANGES:->","(0-2)",null,null,null,"(1-4)",null,null,null,null,"(0-15)",null,null,null,null,"(0-15)",null,null,null,null,null,null,"(0-5)",null,"(0-2)"]
["MULTIPLIER:->",null,null,null,null,273,null,null,null,null,17,null,null,null,null,null,null,null,null,null,null,null,3,null,1]
[null,null,null,null,null,"(273-1092)",null,null,null,null,"(0-255)",null,null,null,null,null,null,null,null,null,null,null,"(0-15)",null,"(0-2)"]
{"$rows_left_out":78}